it2-bootstrap build failure

Aleksey Shipilev aleksey.shipilev at
Thu Aug 9 06:55:21 PDT 2012


I'm trying to build it2-bootstrap, and getting this build error:

make[4]: *** No rule to make target
needed by
make[4]: Leaving directory
make[3]: *** [all] Error 1
make[3]: Leaving directory `/home/shade/trunks/lambda/lambda/jdk/make/java'
make[2]: *** [all] Error 1
make[2]: Leaving directory `/home/shade/trunks/lambda/lambda/jdk/make'
make[1]: *** [jdk-build] Error 2
make[1]: Leaving directory `/home/shade/trunks/lambda/lambda'
make: *** [build_product_image] Error 2

Is there a problem with my environment, or the real repository glitch?
Making a clean rebuild wouldn't help. lambda/lambda builds successfully.


More information about the lambda-dev mailing list