lambda build error

Arul Dhesiaseelan aruld at
Wed Jan 16 22:33:29 PST 2013

I have been happily using the old build system and "make all" failed today.

com/sun/tools/jdeps : no such file or directory
make[2]: *** [initial-image-jdk] Error 1
make[1]: *** [jdk-build] Error 2
make: *** [build_product_image] Error 2

I tried to run using the new build, but configure fails for me on OS X
10.8.2. I even tried pointing to a custom freetype build without any

bash ./configure
checking cups/ppd.h presence... yes
checking for cups/ppd.h... yes
checking for FREETYPE2... yes
checking for FT_Init_FreeType in -lfreetype... no
configure: error: Could not find freetype2!
configure exiting with result code 1

Has any one noticed this? Thanks for your help.


More information about the lambda-dev mailing list