Building Valhalla

Mani Sarkar sadhak001 at gmail.com
Sat Oct 3 04:20:10 UTC 2015


Cool, its working now, I just need to fix something on our cloud and it
should be ready with archives.

Cheers,
Mani

On Fri, Oct 2, 2015 at 11:59 PM, Maurizio Cimadamore <
maurizio.cimadamore at oracle.com> wrote:

>
>
> On 02/10/15 21:44, Mani Sarkar wrote:
>
> Maurizio,
>
> Thanks for the suggestion - would it build the much useful JRE and JDK
> images ?
>
> (dropping build-dev) Yep - it's identical - just skips the last step :-)
>
> Maurizio
>
>
> Cheers,
> Mani
>
> On Fri, Oct 2, 2015 at 9:36 PM, Maurizio Cimadamore <
> <maurizio.cimadamore at oracle.com>maurizio.cimadamore at oracle.com> wrote:
>
>> I believe this has been caused by the latest push...
>>
>> try doing:
>>
>> make jimages
>>
>> afaik that should not run the last verification step ;-)
>>
>> Maurizio
>>
>> On 02/10/15 20:59, Mani Sarkar wrote:
>>
>>> Hi guys,
>>>
>>> I get the below build error half way through build the valhalla build of
>>> OpenJDK:
>>>
>>>
>>>
>>>
>>>
>>>
>>>
>>>
>>>
>>>
>>> *ERROR: Failed module access verificationgmake[3]: *** [checkdeps] Error
>>> 1gmake[3]: Leaving directory
>>> `<
>>> https://adopt-openjdk.ci.cloudbees.com/job/project-valhalla-OpenJDK/ws/valhalla/make
>>> <
>>> https://adopt-openjdk.ci.cloudbees.com/job/project-valhalla-OpenJDK/ws/valhalla/make
>>> >'>gmake[2]:
>>> *** [verify-modules] Error 1gmake[2]: Leaving directory
>>> `<
>>> https://adopt-openjdk.ci.cloudbees.com/job/project-valhalla-OpenJDK/ws/valhalla
>>> <
>>> https://adopt-openjdk.ci.cloudbees.com/job/project-valhalla-OpenJDK/ws/valhalla
>>> >'>make[1]:
>>> *** [main] Error 1make[1]: Leaving directory
>>> `<
>>> https://adopt-openjdk.ci.cloudbees.com/job/project-valhalla-OpenJDK/ws/valhalla
>>> <
>>> https://adopt-openjdk.ci.cloudbees.com/job/project-valhalla-OpenJDK/ws/valhalla
>>> >'>make:
>>> *** [images] Error 2Build step 'Execute shell' marked build as
>>> failureArchiving artifacts*
>>>
>>> Here's the link to the detailed logs -
>>>
>>> https://adopt-openjdk.ci.cloudbees.com/view/OpenJDK/job/project-valhalla-OpenJDK/3/consoleFull
>>>
>>> Whats the fix to the verify modules issue ? Any flags that would help ?
>>> There are a number of errors like "inaccessible reference:
>>> valhalla.model3.Model3Converter (java.base) ->
>>> com.sun.tools.classfile.AccessFlags (jdk.compiler)".
>>>
>>> For your info, I'm building from the
>>> http://hg.openjdk.java.net/valhalla/valhalla/
>>> <http://hg.openjdk.java.net/valhalla/valhalla/corba> repo.
>>>
>>> Cheers,
>>> Mani
>>>
>>>
>>
>
>
> --
> @theNeomatrix369 <http://twitter.com/theNeomatrix369>*  |  **Blog
> <http://neomatrix369.wordpress.com>**  |  *LJC Associate & LJC Advocate
> (@adoptopenjdk & @adoptajsr programs)
> *Meet-a-Project - *MutabilityDetector
> <https://github.com/MutabilityDetector>*  |  **Bitbucket
> <https://bitbucket.org/neomatrix369>* * |  **Github
> <https://github.com/neomatrix369>* * |  **LinkedIn
> <http://uk.linkedin.com/pub/mani-sarkar/71/a77/39b>*
> *Come to Devoxx UK 2016:*  <http://www.devoxx.co.uk/>
> http://www.devoxx.co.uk/
>
> *Don't chase success, rather aim for "Excellence", and success will come
> chasing after you!*
>
>
>


-- 
@theNeomatrix369 <http://twitter.com/theNeomatrix369>*  |  **Blog
<http://neomatrix369.wordpress.com>**  |  *LJC Associate & LJC Advocate
(@adoptopenjdk & @adoptajsr programs)
*Meet-a-Project - *MutabilityDetector
<https://github.com/MutabilityDetector>*  |  **Bitbucket
<https://bitbucket.org/neomatrix369>* * |  **Github
<https://github.com/neomatrix369>* * |  **LinkedIn
<http://uk.linkedin.com/pub/mani-sarkar/71/a77/39b>*
*Come to Devoxx UK 2016:* http://www.devoxx.co.uk/

*Don't chase success, rather aim for "Excellence", and success will come
chasing after you!*


More information about the valhalla-dev mailing list