Time to rebase on top of JDK 9 repository?

Ali Ebrahimi ali.ebrahimi1781 at gmail.com
Wed Oct 28 14:01:17 UTC 2015


Hi,
This error log:

...
duplicate resource "META-INF/services/com.sun.jdi.connect.Connector",
skipping
Updating images/sec-bin.zip
Updating images/sec-windows-bin.zip
Updating images/jgss-windows-x64-bin.zip
## Starting verify-modules
Checking dependencies across JDK modules
Access verification succeeded.
## Finished verify-modules (build time 00:01:17)

Creating JniVersion.dll from 1 file(s)
   Creating library
f:/openjdk/valhalla/build/win/support/test/hotspot/jtreg/nat
ive/support/libJniVersion/JniVersion.lib and object
f:/openjdk/valhalla/build/wi
n/support/test/hotspot/jtreg/native/support/libJniVersion/JniVersion.exp
Creating UninitializedStrings.dll from 1 file(s)
   Creating library
f:/openjdk/valhalla/build/win/support/test/hotspot/jtreg/nat
ive/support/libUninitializedStrings/UninitializedStrings.lib and object
f:/openj
dk/valhalla/build/win/support/test/hotspot/jtreg/native/support/libUninitialized
Strings/UninitializedStrings.exp
Creating DefaultMethods.dll from 1 file(s)
   Creating library
f:/openjdk/valhalla/build/win/support/test/hotspot/jtreg/nat
ive/support/libDefaultMethods/DefaultMethods.lib and object
f:/openjdk/valhalla/
build/win/support/test/hotspot/jtreg/native/support/libDefaultMethods/DefaultMet
hods.exp
Creating ToStringTest.dll from 1 file(s)
   Creating library
f:/openjdk/valhalla/build/win/support/test/hotspot/jtreg/nat
ive/support/libToStringTest/ToStringTest.lib and object
f:/openjdk/valhalla/buil
d/win/support/test/hotspot/jtreg/native/support/libToStringTest/ToStringTest.exp

Creating sanity_SimpleNativeLib.dll from 1 file(s)
   Creating library
f:/openjdk/valhalla/build/win/support/test/jdk/jtreg/native/
support/libsanity_SimpleNativeLib/sanity_SimpleNativeLib.lib and object
f:/openj
dk/valhalla/build/win/support/test/jdk/jtreg/native/support/libsanity_SimpleNati
veLib/sanity_SimpleNativeLib.exp
Creating sanity_SimpleNativeLib2.dll from 1 file(s)
   Creating library
f:/openjdk/valhalla/build/win/support/test/jdk/jtreg/native/
support/libsanity_SimpleNativeLib2/sanity_SimpleNativeLib2.lib and object
f:/ope
njdk/valhalla/build/win/support/test/jdk/jtreg/native/support/libsanity_SimpleNa
tiveLib2/sanity_SimpleNativeLib2.exp
Creating sanity_SimpleNativeLauncher.exe from 1 file(s)
# Running javadoc for images/docs/api/index.html
f:\openjdk\valhalla\jdk\src\java.base\share\classes\java\anyutil\Optional.java:5
2: warning - Tag @link: can't find ifPresent(java.util.function.Consumer)
in jav
a.anyutil.Optional
f:\openjdk\valhalla\jdk\src\java.base\share\classes\java\anyutil\OptionalDouble.
java:50: warning - Tag @link: can't find
ifPresent(java.util.function.DoubleCons
umer) in java.anyutil.OptionalDouble
f:\openjdk\valhalla\jdk\src\java.base\share\classes\java\anyutil\OptionalInt.jav
a:50: warning - Tag @link: can't find
ifPresent(java.util.function.IntConsumer)
in java.anyutil.OptionalInt
f:\openjdk\valhalla\jdk\src\java.base\share\classes\java\anyutil\OptionalLong.ja
va:50: warning - Tag @link: can't find
ifPresent(java.util.function.LongConsumer
) in java.anyutil.OptionalLong
f:\openjdk\valhalla\jdk\src\java.base\share\classes\java\anyutil\PrimitiveIterat
or.java:69: warning - Tag @link: can't find
forEachRemaining(java.util.function.
Consumer) in java.anyutil.Iterator
f:\openjdk\valhalla\jdk\src\java.base\share\classes\java\anyutil\PrimitiveIterat
or.java:69: warning - Tag @link: can't find
forEachRemaining(java.util.function.
IntConsumer) in java.anyutil.PrimitiveIterator.OfInt
f:\openjdk\valhalla\jdk\src\java.base\share\classes\java\anyutil\PrimitiveIterat
or.java:69: warning - Tag @link: can't find
forEachRemaining(java.util.function.
Consumer) in java.anyutil.PrimitiveIterator.OfInt
f:\openjdk\valhalla\jdk\src\java.base\share\classes\java\anyutil\PrimitiveIterat
or.java:69: warning - Tag @link: can't find
forEachRemaining(java.util.function.
Consumer) in java.anyutil.Iterator
f:\openjdk\valhalla\jdk\src\java.base\share\classes\java\anyutil\Spliterator.jav
a:296: warning - Tag @link: can't find
tryAdvance(java.util.function.Consumer) i
n java.anyutil.Spliterator
f:\openjdk\valhalla\jdk\src\java.base\share\classes\java\anyutil\Spliterator.jav
a:296: warning - Tag @link: can't find
forEachRemaining(java.util.function.Consu
mer) in java.anyutil.Spliterator
f:\openjdk\valhalla\jdk\src\java.base\share\classes\java\anyutil\Spliterator.jav
a:296: warning - Tag @link: can't find
tryAdvance(java.util.function.IntConsumer
) in java.anyutil.Spliterator.OfInt
f:\openjdk\valhalla\jdk\src\java.base\share\classes\java\anyutil\Spliterator.jav
a:296: warning - Tag @link: can't find
forEachRemaining(java.util.function.IntCo
nsumer) in java.anyutil.Spliterator.OfInt
f:\openjdk\valhalla\jdk\src\java.base\share\classes\java\anyutil\Spliterator.jav
a:296: warning - Tag @link: can't find
tryAdvance(java.util.function.Consumer) i
n java.anyutil.Spliterator.OfInt
f:\openjdk\valhalla\jdk\src\java.base\share\classes\java\anyutil\Spliterator.jav
a:296: warning - Tag @link: can't find
forEachRemaining(java.util.function.Consu
mer) in java.anyutil.Spliterator.OfInt
f:\openjdk\valhalla\jdk\src\java.base\share\classes\java\anyutil\Spliterator.jav
a:296: warning - Tag @link: can't find
forEachRemaining(java.util.function.Consu
mer) in java.anyutil.Spliterator
f:\openjdk\valhalla\jdk\src\java.base\share\classes\java\anyutil\Spliterator.jav
a:886: warning - Tag @link: can't find
tryAdvance(java.util.function.DoubleConsu
mer) in java.anyutil.Spliterator.OfDouble
f:\openjdk\valhalla\jdk\src\java.base\share\classes\java\anyutil\Spliterator.jav
a:886: warning - Tag @link: can't find
tryAdvance(java.util.function.DoubleConsu
mer) in java.anyutil.Spliterator.OfDouble
f:\openjdk\valhalla\jdk\src\java.base\share\classes\java\anyutil\Spliterator.jav
a:905: warning - Tag @link: can't find
forEachRemaining(java.util.function.Doubl
eConsumer) in java.anyutil.Spliterator.OfDouble
f:\openjdk\valhalla\jdk\src\java.base\share\classes\java\anyutil\Spliterator.jav
a:905: warning - Tag @link: can't find
forEachRemaining(java.util.function.Doubl
eConsumer) in java.anyutil.Spliterator.OfDouble
f:\openjdk\valhalla\jdk\src\java.base\share\classes\java\anyutil\Spliterator.jav
a:668: warning - Tag @link: can't find
tryAdvance(java.util.function.IntConsumer
) in java.anyutil.Spliterator.OfInt
f:\openjdk\valhalla\jdk\src\java.base\share\classes\java\anyutil\Spliterator.jav
a:668: warning - Tag @link: can't find
tryAdvance(java.util.function.IntConsumer
) in java.anyutil.Spliterator.OfInt
f:\openjdk\valhalla\jdk\src\java.base\share\classes\java\anyutil\Spliterator.jav
a:686: warning - Tag @link: can't find
forEachRemaining(java.util.function.IntCo
nsumer) in java.anyutil.Spliterator.OfInt
f:\openjdk\valhalla\jdk\src\java.base\share\classes\java\anyutil\Spliterator.jav
a:686: warning - Tag @link: can't find
forEachRemaining(java.util.function.IntCo
nsumer) in java.anyutil.Spliterator.OfInt
f:\openjdk\valhalla\jdk\src\java.base\share\classes\java\anyutil\Spliterator.jav
a:777: warning - Tag @link: can't find
tryAdvance(java.util.function.LongConsume
r) in java.anyutil.Spliterator.OfLong
f:\openjdk\valhalla\jdk\src\java.base\share\classes\java\anyutil\Spliterator.jav
a:777: warning - Tag @link: can't find
tryAdvance(java.util.function.LongConsume
r) in java.anyutil.Spliterator.OfLong
f:\openjdk\valhalla\jdk\src\java.base\share\classes\java\anyutil\Spliterator.jav
a:795: warning - Tag @link: can't find
forEachRemaining(java.util.function.LongC
onsumer) in java.anyutil.Spliterator.OfLong
f:\openjdk\valhalla\jdk\src\java.base\share\classes\java\anyutil\Spliterator.jav
a:795: warning - Tag @link: can't find
forEachRemaining(java.util.function.LongC
onsumer) in java.anyutil.Spliterator.OfLong
f:\openjdk\valhalla\jdk\src\java.base\share\classes\java\anyutil\Spliterators.ja
va:1616: warning - Tag @see: can't find
spliterator(java.util.PrimitiveIterator.
OfDouble, long, int) in java.anyutil.Spliterators.AbstractDoubleSpliterator
f:\openjdk\valhalla\jdk\src\java.base\share\classes\java\anyutil\Spliterators.ja
va:1616: warning - Tag @link: can't find
tryAdvance(java.util.function.DoubleCon
sumer) in java.anyutil.Spliterators.AbstractDoubleSpliterator
f:\openjdk\valhalla\jdk\src\java.base\share\classes\java\anyutil\Spliterators.ja
va:1616: warning - Tag @link: can't find
forEachRemaining(java.util.function.Dou
bleConsumer) in java.anyutil.Spliterators.AbstractDoubleSpliterator
f:\openjdk\valhalla\jdk\src\java.base\share\classes\java\anyutil\Spliterators.ja
va:1396: warning - Tag @see: can't find
spliterator(java.util.PrimitiveIterator.
OfInt, long, int) in java.anyutil.Spliterators.AbstractIntSpliterator
f:\openjdk\valhalla\jdk\src\java.base\share\classes\java\anyutil\Spliterators.ja
va:1396: warning - Tag @link: can't find
tryAdvance(java.util.function.IntConsum
er) in java.anyutil.Spliterators.AbstractIntSpliterator
f:\openjdk\valhalla\jdk\src\java.base\share\classes\java\anyutil\Spliterators.ja
va:1396: warning - Tag @link: can't find forEachRemaining(
java.util.function.Int
Consumer) in java.anyutil.Spliterators.AbstractIntSpliterator
f:\openjdk\valhalla\jdk\src\java.base\share\classes\java\anyutil\Spliterators.ja
va:1506: warning - Tag @see: can't find
spliterator(java.util.PrimitiveIterator.
OfLong, long, int) in java.anyutil.Spliterators.AbstractLongSpliterator
f:\openjdk\valhalla\jdk\src\java.base\share\classes\java\anyutil\Spliterators.ja
va:1506: warning - Tag @link: can't find
tryAdvance(java.util.function.LongConsu
mer) in java.anyutil.Spliterators.AbstractLongSpliterator
f:\openjdk\valhalla\jdk\src\java.base\share\classes\java\anyutil\Spliterators.ja
va:1506: warning - Tag @link: can't find
forEachRemaining(java.util.function.Lon
gConsumer) in java.anyutil.Spliterators.AbstractLongSpliterator
f:\openjdk\valhalla\jdk\src\java.base\share\classes\java\anyutil\Spliterators.ja
va:1272: warning - Tag @link: can't find
tryAdvance(java.util.function.Consumer)
 in java.anyutil.Spliterators.AbstractSpliterator
f:\openjdk\valhalla\jdk\src\java.base\share\classes\java\anyutil\Spliterators.ja
va:1272: warning - Tag @link: can't find
forEachRemaining(java.util.function.Con
sumer) in java.anyutil.Spliterators.AbstractSpliterator
f:\openjdk\valhalla\jdk\src\java.base\share\classes\java\anyutil\Spliterators.ja
va:1616: warning - Tag @link: can't find
spliterator(java.util.PrimitiveIterator
.OfDouble, long, int) in java.anyutil.Spliterators.AbstractDoubleSpliterator
f:\openjdk\valhalla\jdk\src\java.base\share\classes\java\anyutil\Spliterators.ja
va:1396: warning - Tag @link: can't find
spliterator(java.util.PrimitiveIterator
.OfInt, long, int) in java.anyutil.Spliterators.AbstractIntSpliterator
f:\openjdk\valhalla\jdk\src\java.base\share\classes\java\anyutil\Spliterators.ja
va:1506: warning - Tag @link: can't find
spliterator(java.util.PrimitiveIterator
.OfLong, long, int) in java.anyutil.Spliterators.AbstractLongSpliterator
f:\openjdk\valhalla\jdk\src\java.base\share\classes\java\anyutil\function\Double
Function.java:41: warning - Tag @link: can't find apply(double) in
java.anyutil.
function.DoubleFunction
f:\openjdk\valhalla\jdk\src\java.base\share\classes\java\anyutil\function\Double
Predicate.java:41: warning - Tag @link: can't find test(double) in
java.anyutil.
function.DoublePredicate
f:\openjdk\valhalla\jdk\src\java.base\share\classes\java\anyutil\function\IntFun
ction.java:41: warning - Tag @link: can't find apply(int) in
java.anyutil.functi
on.IntFunction
f:\openjdk\valhalla\jdk\src\java.base\share\classes\java\anyutil\function\IntPre
dicate.java:41: warning - Tag @link: can't find test(int) in
java.anyutil.functi
on.IntPredicate
f:\openjdk\valhalla\jdk\src\java.base\share\classes\java\anyutil\function\LongFu
nction.java:41: warning - Tag @link: can't find apply(long) in
java.anyutil.func
tion.LongFunction
f:\openjdk\valhalla\jdk\src\java.base\share\classes\java\anyutil\function\LongPr
edicate.java:41: warning - Tag @link: can't find test(long) in
java.anyutil.func
tion.LongPredicate
f:\openjdk\valhalla\jdk\src\java.base\share\classes\java\anyutil\stream\StreamSu
pport.java:105: warning - Tag @see: can't find
stream(java.util.Spliterator, boo
lean) in java.anyutil.stream.StreamSupport
f:\openjdk\valhalla\jdk\src\java.base\share\classes\java\anyutil\stream\StreamSu
pport.java:175: warning - Tag @see: can't find
intStream(java.util.Spliterator.O
fInt, boolean) in java.anyutil.stream.StreamSupport
f:\openjdk\valhalla\jdk\src\java.base\share\classes\java\anyutil\stream\StreamSu
pport.java:245: warning - Tag @see: can't find
longStream(java.util.Spliterator.
OfLong, boolean) in java.anyutil.stream.StreamSupport
f:\openjdk\valhalla\jdk\src\java.base\share\classes\java\anyutil\stream\StreamSu
pport.java:315: warning - Tag @see: can't find
doubleStream(java.util.Spliterato
r.OfDouble, boolean) in java.anyutil.stream.StreamSupport
f:\openjdk\valhalla\jdk\src\java.base\share\classes\java\anyutil\stream\StreamSu
pport.java:275: warning - Tag @link: can't find
doubleStream(java.util.function.
Supplier, int, boolean) in java.anyutil.stream.StreamSupport
f:\openjdk\valhalla\jdk\src\java.base\share\classes\java\anyutil\stream\StreamSu
pport.java:315: warning - Tag @link: can't find
doubleStream(java.util.Spliterat
or.OfDouble, boolean) in java.anyutil.stream.StreamSupport
f:\openjdk\valhalla\jdk\src\java.base\share\classes\java\anyutil\stream\StreamSu
pport.java:136: warning - Tag @link: can't find
intStream(java.util.function.Sup
plier, int, boolean) in java.anyutil.stream.StreamSupport
f:\openjdk\valhalla\jdk\src\java.base\share\classes\java\anyutil\stream\StreamSu
pport.java:175: warning - Tag @link: can't find
intStream(java.util.Spliterator.
OfInt, boolean) in java.anyutil.stream.StreamSupport
f:\openjdk\valhalla\jdk\src\java.base\share\classes\java\anyutil\stream\StreamSu
pport.java:205: warning - Tag @link: can't find longStream(
java.util.function.Su
pplier, int, boolean) in java.anyutil.stream.StreamSupport
f:\openjdk\valhalla\jdk\src\java.base\share\classes\java\anyutil\stream\StreamSu
pport.java:245: warning - Tag @link: can't find
longStream(java.util.Spliterator
.OfLong, boolean) in java.anyutil.stream.StreamSupport
f:\openjdk\valhalla\jdk\src\java.base\share\classes\java\anyutil\stream\StreamSu
pport.java:67: warning - Tag @link: can't find
stream(java.util.function.Supplie
r, int, boolean) in java.anyutil.stream.StreamSupport
f:\openjdk\valhalla\jdk\src\java.base\share\classes\java\anyutil\stream\StreamSu
pport.java:105: warning - Tag @link: can't find
stream(java.util.Spliterator, bo
olean) in java.anyutil.stream.StreamSupport
1 error: error - GC overhead limit exceeded

59 warnings
Javadoc.gmk:403: recipe for target
'/cygdrive/f/openjdk/valhalla/build/win/image
s/docs/api/index.html' failedmake[3]: ***
[/cygdrive/f/openjdk/valhalla/build/wi
n/images/docs/api/index.html] Error 1

make/Main.gmk:254: recipe for target 'docs-javadoc' failedmake[2]: ***
[docs-jav
adoc] Error 1


ERROR: Build failed for target 'all' in configuration 'win' (exit code 2)
=== Make failure sequence repeated here ===
Javadoc.gmk:403: recipe for target
'/cygdrive/f/openjdk/valhalla/build/win/image
s/docs/api/index.html' failed
make/Main.gmk:254: recipe for target 'docs-javadoc' failed
=== End of repeated output ===
Hint: Try searching the build log for the name of the first failed target.
Hint: If caused by a warning, try configure --disable-warnings-as-errors.

/cygdrive/f/openjdk/valhalla/make/Init.gmk:276: recipe for target 'main'
failed
make[1]: *** [main] Error 1
/cygdrive/f/openjdk/valhalla/make/Init.gmk:180: recipe for target 'all'
failed
make: *** [all] Error 2

On Wed, Oct 28, 2015 at 3:37 PM, Maurizio Cimadamore <
maurizio.cimadamore at oracle.com> wrote:

> Did you sync up with latest changes? Which error do you get?
>
> Maurizio
>
>

-- 

Best Regards,
Ali Ebrahimi


More information about the valhalla-dev mailing list