[8u] java/util/{Calendar, TimeZone} test failures

Aleksey Shipilev shade at redhat.com
Wed Aug 21 17:16:12 UTC 2019


I am running tier1 in jdk8u-dev, and these tests fail:

FAILED: java/util/Calendar/CalendarRegression.java
FAILED: java/util/Calendar/JapanEraNameCompatTest.java
FAILED: java/util/TimeZone/HongKong.java

They seem to fail since 8u222. There seems to be a gap in locale data somewhere? Is anyone looking
into that?


More information about the jdk8u-dev mailing list