[8u] java/util/{Calendar, TimeZone} test failures

Andrew John Hughes gnu.andrew at redhat.com
Thu Aug 22 15:25:35 UTC 2019

On 21/08/2019 18:16, Aleksey Shipilev wrote:
> Hi,
> I am running tier1 in jdk8u-dev, and these tests fail:
> FAILED: java/util/Calendar/CalendarRegression.java
> FAILED: java/util/Calendar/JapanEraNameCompatTest.java
> FAILED: java/util/TimeZone/HongKong.java
> They seem to fail since 8u222. There seems to be a gap in locale data somewhere? Is anyone looking
> into that?

Not right now, but I'm aware of it.

I'll try and find some time once we fork for 8u232. It's going to mean
cherry-picking some locale changes from 9+.

Andrew :)

Senior Free Java Software Engineer
Red Hat, Inc. (http://www.redhat.com)

PGP Key: ed25519/0xCFDA0F9B35964222 (hkp://keys.gnupg.net)
Fingerprint = 5132 579D D154 0ED2 3E04  C5A0 CFDA 0F9B 3596 4222

More information about the jdk8u-dev mailing list