TaskExecutionException: Execution failed for task ':web:compileGeneratedWin'

Leonid Popov leonid.popov at oracle.com
Fri Mar 21 12:31:56 UTC 2014

Hi, I updated my workspace recently, tried to build it and have got the 
following exception. Any suggestions?

  FAILURE: Build failed with an exception.

  * What went wrong:
  Execution failed for task ':web:compileGeneratedWin'.
  > java.lang.ClassFormatError: Invalid Constant Pool entry Type 18

  * Exception is:
  org.gradle.api.tasks.TaskExecutionException: Execution failed for task 

-- Thanks, Leonid

More information about the openjfx-dev mailing list