TaskExecutionException: Execution failed for task ':web:compileGeneratedWin'

Kevin Rushforth kevin.rushforth at oracle.com
Fri Mar 21 12:49:49 UTC 2014

Are you using gradle 1.8? This looks like a bug we used to have with 
prior versions of gradle.

-- Kevin

Leonid Popov wrote:
> Hi, I updated my workspace recently, tried to build it and have got 
> the following exception. Any suggestions?
>  FAILURE: Build failed with an exception.
>  * What went wrong:
>  Execution failed for task ':web:compileGeneratedWin'.
>  > java.lang.ClassFormatError: Invalid Constant Pool entry Type 18
>  * Exception is:
>  org.gradle.api.tasks.TaskExecutionException: Execution failed for 
> task ':web:compileGeneratedWin'.

More information about the openjfx-dev mailing list