hg: valhalla/valhalla: 187 new changesets

david.simms at oracle.com david.simms at oracle.com
Tue Jun 4 14:47:11 UTC 2019


Changeset: cdb107ca16e6
Author:    redestad
Date:      2019-05-23 18:43 +0200
URL:       http://hg.openjdk.java.net/valhalla/valhalla/rev/cdb107ca16e6

8224202: Speed up Properties.load
Reviewed-by: rriggs, igerasim

! src/java.base/share/classes/java/util/Properties.java

Changeset: 8559810c60f8
Author:    aeubanks
Date:      2019-05-23 09:03 -0700
URL:       http://hg.openjdk.java.net/valhalla/valhalla/rev/8559810c60f8

8224635: Revert 8224256 and add back java/security/SecureClassLoader/DefineClass.java test
Reviewed-by: mullan
Contributed-by: aeubanks at google.com

! test/jdk/ProblemList.txt
! test/jdk/java/security/SecureClassLoader/DefineClass.java
! test/jdk/java/security/SecureClassLoader/DefineClass.policy

Changeset: 2218f9d57d2f
Author:    ccheung
Date:      2019-05-23 10:05 -0700
URL:       http://hg.openjdk.java.net/valhalla/valhalla/rev/2218f9d57d2f

8224264: [TESTBUG] HelloDynamicCustom.java test failed on the Windows platform in tiers 6 and 7 testing
Summary: Making use of the DynamicArchiveTestBase class so that mapping failure can be handled more robustly.
Reviewed-by: iklam

! test/hotspot/jtreg/runtime/appcds/dynamicArchive/HelloDynamicCustom.java

Changeset: fb0cfce19262
Author:    mseledtsov
Date:      2019-05-23 11:37 -0700
URL:       http://hg.openjdk.java.net/valhalla/valhalla/rev/fb0cfce19262

8224165: [TESTBUG] Docker tests produce excessive output
Summary: Trimmed child process output, saving child stdout to file
Reviewed-by: dholmes, lmesnik

! test/lib/jdk/test/lib/containers/docker/DockerTestUtils.java

Changeset: 8dae495a59e7
Author:    naoto
Date:      2019-05-23 12:21 -0700
URL:       http://hg.openjdk.java.net/valhalla/valhalla/rev/8dae495a59e7

8221431: Support for Unicode 12.1
Reviewed-by: erikj, rriggs

! make/CompileJavaModules.gmk
! make/ToolsJdk.gmk
! make/data/characterdata/CharacterData00.java.template
! make/data/characterdata/CharacterData01.java.template
+ make/data/unicodedata/Blocks.txt
+ make/data/unicodedata/NormalizationTest.txt
! make/data/unicodedata/PropList.txt
+ make/data/unicodedata/PropertyValueAliases.txt
! make/data/unicodedata/Scripts.txt
! make/data/unicodedata/SpecialCasing.txt
! make/data/unicodedata/UnicodeData.txt
! make/data/unicodedata/VERSION
+ make/data/unicodedata/auxiliary/GraphemeBreakProperty.txt
+ make/data/unicodedata/auxiliary/GraphemeBreakTest.txt
+ make/data/unicodedata/emoji-data.txt
! make/gensrc/Gensrc-java.base.gmk
+ make/gensrc/GensrcEmojiData.gmk
+ make/jdk/src/classes/build/tools/generateemojidata/GenerateEmojiData.java
! src/java.base/share/classes/java/lang/Character.java
+ src/java.base/share/classes/java/util/regex/EmojiData.java.template
! src/java.base/share/classes/java/util/regex/Grapheme.java
! src/java.base/share/classes/java/util/regex/Pattern.java
+ src/java.base/share/classes/sun/text/normalizer/CodePointMap.java
+ src/java.base/share/classes/sun/text/normalizer/CodePointTrie.java
! src/java.base/share/classes/sun/text/normalizer/ICUBinary.java
! src/java.base/share/classes/sun/text/normalizer/Norm2AllModes.java
! src/java.base/share/classes/sun/text/normalizer/NormalizerImpl.java
- src/java.base/share/classes/sun/text/resources/nfc.icu
+ src/java.base/share/classes/sun/text/resources/nfc.nrm
- src/java.base/share/classes/sun/text/resources/nfkc.icu
+ src/java.base/share/classes/sun/text/resources/nfkc.nrm
- src/java.base/share/classes/sun/text/resources/nfkc_cf.icu
! src/java.base/share/classes/sun/text/resources/ubidi.icu
! src/java.base/share/classes/sun/text/resources/uprops.icu
! src/java.base/share/legal/icu.md
! src/java.base/share/legal/unicode.md
! test/jdk/java/lang/Character/CharPropTest.java
! test/jdk/java/lang/Character/CheckProp.java
! test/jdk/java/lang/Character/CheckScript.java
! test/jdk/java/lang/Character/CheckUnicode.java
- test/jdk/java/lang/Character/PropList.txt
- test/jdk/java/lang/Character/PropertyValueAliases.txt
- test/jdk/java/lang/Character/Scripts.txt
- test/jdk/java/lang/Character/SpecialCasing.txt
- test/jdk/java/lang/Character/UnicodeBlock/Blocks.txt
! test/jdk/java/lang/Character/UnicodeBlock/CheckBlocks.java
! test/jdk/java/lang/Character/UnicodeBlock/OptimalMapSize.java
! test/jdk/java/lang/Character/UnicodeCasingTest.java
- test/jdk/java/lang/Character/UnicodeData.txt
- test/jdk/java/lang/Character/charprop00.bin
- test/jdk/java/lang/Character/charprop01.bin
- test/jdk/java/lang/Character/charprop02.bin
- test/jdk/java/lang/Character/charprop03.bin
- test/jdk/java/lang/Character/charprop0E.bin
- test/jdk/java/lang/Character/charprop0F.bin
- test/jdk/java/lang/Character/charprop10.bin
! test/jdk/java/lang/String/SpecialCasingTest.java
! test/jdk/java/lang/String/UnicodeCasingTest.java
+ test/jdk/java/text/Normalizer/ConformanceTest.java
+ test/jdk/java/text/Normalizer/DataValidationTest.java
+ test/jdk/java/text/Normalizer/ICUBasicTest.java
+ test/jdk/java/text/Normalizer/ICUNormalizationTest.txt
+ test/jdk/java/text/Normalizer/NormalizationTest-3.2.0.Corrigendum4.txt
+ test/jdk/java/text/Normalizer/NormalizationTest-3.2.0.txt
+ test/jdk/java/text/Normalizer/SquareEraCharacterTest.java
- test/jdk/java/util/regex/GraphemeBreakProperty.txt
- test/jdk/java/util/regex/GraphemeBreakTest.txt
! test/jdk/java/util/regex/GraphemeTest.java
! test/jdk/java/util/regex/RegExTest.java
+ test/jdk/lib/testlibrary/java/lang/UCDFiles.java

Changeset: 8b43726c1a47
Author:    iklam
Date:      2019-05-23 12:57 -0700
URL:       http://hg.openjdk.java.net/valhalla/valhalla/rev/8b43726c1a47

8224689: ProblemList runtime/appcds/SharedArchiveConsistency.java
Reviewed-by: ccheung, dcubed

! test/hotspot/jtreg/ProblemList.txt

Changeset: 738285c4d1e1
Author:    rkennke
Date:      2019-05-23 17:01 +0200
URL:       http://hg.openjdk.java.net/valhalla/valhalla/rev/738285c4d1e1

8224667: Shenandoah: Post-LRB cleanup
Reviewed-by: shade

! src/hotspot/share/gc/shenandoah/c2/shenandoahBarrierSetC2.cpp
! src/hotspot/share/gc/shenandoah/c2/shenandoahBarrierSetC2.hpp
! src/hotspot/share/gc/shenandoah/c2/shenandoahSupport.cpp
! src/hotspot/share/gc/shenandoah/shenandoahBarrierSet.cpp
! src/hotspot/share/gc/shenandoah/shenandoahBarrierSet.hpp
! src/hotspot/share/gc/shenandoah/shenandoahBarrierSet.inline.hpp

Changeset: 4f98fcd1bf16
Author:    igerasim
Date:      2019-05-23 13:48 -0700
URL:       http://hg.openjdk.java.net/valhalla/valhalla/rev/4f98fcd1bf16

7061590: Javadoc issues in Charset and StandardCharsets
Reviewed-by: alanb, jjg

! src/java.base/share/classes/java/nio/charset/Charset.java
! src/java.base/share/classes/java/nio/charset/StandardCharsets.java

Changeset: 5dc15cb1405c
Author:    erikj
Date:      2019-05-23 14:13 -0700
URL:       http://hg.openjdk.java.net/valhalla/valhalla/rev/5dc15cb1405c

8224677: Dtrace .d files clash with make dependency .d files
Reviewed-by: tbell

! make/hotspot/lib/JvmDtraceObjects.gmk

Changeset: ecb7b9a98f0e
Author:    erikj
Date:      2019-05-23 14:14 -0700
URL:       http://hg.openjdk.java.net/valhalla/valhalla/rev/ecb7b9a98f0e

8224145: Build compare script fails intermittently on test image native libraries
Reviewed-by: tbell

! make/scripts/compare.sh
! make/scripts/compare_exceptions.sh.incl

Changeset: c55404ed4bd9
Author:    jwilhelm
Date:      2019-05-24 03:17 +0200
URL:       http://hg.openjdk.java.net/valhalla/valhalla/rev/c55404ed4bd9

8224715: ProblemList compiler/graalunit/HotspotJdk9Test.java
Reviewed-by: mikael

! test/hotspot/jtreg/ProblemList-graal.txt

Changeset: 2bcb825c8edf
Author:    mseledtsov
Date:      2019-05-23 18:31 -0700
URL:       http://hg.openjdk.java.net/valhalla/valhalla/rev/2bcb825c8edf

8224706: [TESTBUG] problem list failing JDK docker API tests
Summary: Put the failing tests on a problem list
Reviewed-by: lmesnik

! test/jdk/ProblemList.txt

Changeset: d84176dd57b0
Author:    darcy
Date:      2019-05-23 18:47 -0700
URL:       http://hg.openjdk.java.net/valhalla/valhalla/rev/d84176dd57b0

8224177: Harden annotation processing framework to irregular behavior from processors
Reviewed-by: jjg

! src/jdk.compiler/share/classes/com/sun/tools/javac/processing/JavacProcessingEnvironment.java
! src/jdk.compiler/share/classes/com/sun/tools/javac/resources/compiler.properties
+ test/langtools/tools/javac/diags/examples/DuplicateSupportedInfoFromProc/DuplicateSupportedInfoFromProc.java
+ test/langtools/tools/javac/diags/examples/DuplicateSupportedInfoFromProc/processors/AnnoProc.java
! test/langtools/tools/javac/diags/examples/MalformedSupported/MalformedSupported.java
+ test/langtools/tools/javac/diags/examples/RedundantTypesWithWildcardProc/RedundantTypesWithWildcardProc.java
+ test/langtools/tools/javac/diags/examples/RedundantTypesWithWildcardProc/processors/AnnoProc.java
+ test/langtools/tools/javac/processing/warnings/TestRepeatedItemsRuntime.java
+ test/langtools/tools/javac/processing/warnings/auric_current.out

Changeset: 9785b9fb328e
Author:    clanger
Date:      2019-05-24 07:56 +0100
URL:       http://hg.openjdk.java.net/valhalla/valhalla/rev/9785b9fb328e

8223553: Fix code constructs that do not compile with the Eclipse Java Compiler
Reviewed-by: smarks, dfuchs

! src/java.base/share/classes/java/lang/invoke/MethodHandles.java
! src/java.management/share/classes/java/lang/management/ManagementFactory.java
! src/java.net.http/share/classes/jdk/internal/net/http/ExchangeImpl.java

Changeset: d56d8e40b6cd
Author:    stuefe
Date:      2019-05-24 09:02 +0200
URL:       http://hg.openjdk.java.net/valhalla/valhalla/rev/d56d8e40b6cd

8220394: bufferedStream does not honor size limit
Reviewed-by: dholmes, clanger

! src/hotspot/share/utilities/ostream.cpp
! src/hotspot/share/utilities/ostream.hpp
! test/hotspot/gtest/utilities/test_ostream.cpp

Changeset: 948385f851f2
Author:    lucy
Date:      2019-05-23 18:50 +0200
URL:       http://hg.openjdk.java.net/valhalla/valhalla/rev/948385f851f2

8224652: 32-bit build failures after JDK-8213084
Reviewed-by: thartmann, shade
Contributed-by: shade at redhat.com

! src/hotspot/share/compiler/abstractDisassembler.cpp
! src/hotspot/share/utilities/globalDefinitions.hpp

Changeset: e93621d4db2c
Author:    thartmann
Date:      2019-05-24 09:51 +0200
URL:       http://hg.openjdk.java.net/valhalla/valhalla/rev/e93621d4db2c

8224723: [TESTBUG] compiler/arraycopy/TestArrayCopyWithBadOffset.java failed
Summary: Added missing -XX:+IgnoreUnrecognizedVMOptions
Reviewed-by: thartmann
Contributed-by: wangxue at loongson.cn

! test/hotspot/jtreg/compiler/arraycopy/TestArrayCopyWithBadOffset.java

Changeset: a8673ccddffd
Author:    dkejriwal
Date:      2019-05-23 12:36 +0530
URL:       http://hg.openjdk.java.net/valhalla/valhalla/rev/a8673ccddffd

8214563: Use {@systemProperty} in specification of system properties in java.nio packages
8214565: Use {@systemProperty} for definitions of system properties
Reviewed-by: alanb, rriggs

! src/java.base/share/classes/java/io/FilePermission.java
! src/java.base/share/classes/java/io/ObjectInputFilter.java
! src/java.base/share/classes/java/nio/channels/AsynchronousChannelGroup.java
! src/java.base/share/classes/java/nio/channels/spi/AsynchronousChannelProvider.java
! src/java.base/share/classes/java/nio/channels/spi/SelectorProvider.java
! src/java.base/share/classes/java/nio/file/spi/FileSystemProvider.java

Changeset: adb2493b120e
Author:    jlahoda
Date:      2019-05-24 12:25 +0200
URL:       http://hg.openjdk.java.net/valhalla/valhalla/rev/adb2493b120e

8220702: compiling in the context of an automatic module disallows --add-modules ALL-MODULE-PATH
Summary: Allow --add-modules ALL-MODULE-PATH when compiling in the context of an automatic module.
Reviewed-by: jjg

! src/jdk.compiler/share/classes/com/sun/tools/javac/comp/Modules.java
! src/jdk.compiler/share/classes/com/sun/tools/javac/resources/compiler.properties
! test/langtools/tools/javac/modules/AutomaticModules.java

Changeset: da5435d9a801
Author:    zgu
Date:      2019-05-24 09:23 -0400
URL:       http://hg.openjdk.java.net/valhalla/valhalla/rev/da5435d9a801

8224679: Shenandoah: Make ShenandoahParallelCodeCacheIterator noncopyable
Reviewed-by: rkennke, shade

! src/hotspot/share/gc/shenandoah/shenandoahCodeRoots.cpp
! src/hotspot/share/gc/shenandoah/shenandoahCodeRoots.hpp

Changeset: fc66237d5eae
Author:    zgu
Date:      2019-05-22 21:24 -0400
URL:       http://hg.openjdk.java.net/valhalla/valhalla/rev/fc66237d5eae

8224115: Shenandoah: Eliminate RWLock that protects recorded nmethod data array
Reviewed-by: shade

! src/hotspot/share/gc/shenandoah/shenandoahCodeRoots.cpp
! src/hotspot/share/gc/shenandoah/shenandoahCodeRoots.hpp

Changeset: 703b2c04fc2c
Author:    lucy
Date:      2019-05-24 15:36 +0200
URL:       http://hg.openjdk.java.net/valhalla/valhalla/rev/703b2c04fc2c

8224742: JLONG_FORMAT_W incompatible with type jlong
Reviewed-by: thartmann, clanger

! src/hotspot/share/utilities/globalDefinitions_gcc.hpp

Changeset: 37a077319427
Author:    dfuchs
Date:      2019-05-24 15:34 +0100
URL:       http://hg.openjdk.java.net/valhalla/valhalla/rev/37a077319427

8224603: Replace wildcard address with loopback or local host in tests - part 11
Summary: Fixes a batch of tests that were observed failing intermittently.
Reviewed-by: chegar, vtewari

! test/jdk/com/sun/net/httpserver/SelCacheTest.java
! test/jdk/com/sun/net/httpserver/bugs/6725892/Test.java
! test/jdk/java/net/Authenticator/B4722333.java
! test/jdk/java/net/DatagramSocket/Send12k.java
! test/jdk/java/net/Socket/CloseAvailable.java
! test/jdk/java/net/Socket/setReuseAddress/Restart.java
! test/jdk/java/net/Socks/BadProxySelector.java
! test/jdk/java/net/Socks/SocksProxyVersion.java
! test/jdk/java/net/URLPermission/URLTest.java
! test/jdk/sun/net/www/http/ChunkedOutputStream/CheckError.java
! test/jdk/sun/net/www/httptest/TestHttpServer.java
! test/jdk/sun/net/www/protocol/https/ChunkedOutputStream.java
! test/jdk/sun/net/www/protocol/https/TestHttpsServer.java

Changeset: 11d9cd8d99f3
Author:    dl
Date:      2019-05-24 08:39 -0700
URL:       http://hg.openjdk.java.net/valhalla/valhalla/rev/11d9cd8d99f3

8224698: ConcurrentSkipListMap.java does not compile with the Eclipse Java Compiler
Reviewed-by: martin, clanger, smarks, dfuchs

! src/java.base/share/classes/java/util/concurrent/ConcurrentSkipListMap.java

Changeset: c72451a9f67e
Author:    dl
Date:      2019-05-24 08:43 -0700
URL:       http://hg.openjdk.java.net/valhalla/valhalla/rev/c72451a9f67e

8224176: Fix inconsistencies in @jls tags in java.util.concurrent
Reviewed-by: martin, darcy, jjg

! src/java.base/share/classes/java/util/concurrent/atomic/AtomicInteger.java
! src/java.base/share/classes/java/util/concurrent/atomic/AtomicLong.java

Changeset: f46be958c4ac
Author:    dl
Date:      2019-05-24 08:47 -0700
URL:       http://hg.openjdk.java.net/valhalla/valhalla/rev/f46be958c4ac

8224024: java/util/concurrent/BlockingQueue/DrainToFails.java testBounded fails intermittently
Reviewed-by: martin

! test/jdk/java/util/concurrent/BlockingQueue/DrainToFails.java

Changeset: 3a30c73838f6
Author:    dl
Date:      2019-05-24 08:51 -0700
URL:       http://hg.openjdk.java.net/valhalla/valhalla/rev/3a30c73838f6

8220478: java/util/concurrent/ConcurrentHashMap/ToArray.java timed out intermittently
8223379: Clarify ForkJoinPool.getStealCount() javadoc
Reviewed-by: martin

! src/java.base/share/classes/java/util/concurrent/ForkJoinPool.java

Changeset: 265b110fc022
Author:    dl
Date:      2019-05-24 08:55 -0700
URL:       http://hg.openjdk.java.net/valhalla/valhalla/rev/265b110fc022

8223245: Miscellaneous changes imported from jsr166 CVS 2019-06
Reviewed-by: martin

! src/java.base/share/classes/java/util/ArrayList.java
! src/java.base/share/classes/java/util/Vector.java

Changeset: 290679ec47bb
Author:    rhalade
Date:      2019-05-24 09:47 -0700
URL:       http://hg.openjdk.java.net/valhalla/valhalla/rev/290679ec47bb

8202651: Test ComodoCA.java fails
Reviewed-by: mullan

! test/jdk/security/infra/java/security/cert/CertPathValidator/certification/ComodoCA.java

Changeset: 4ccc8d8bc02b
Author:    joehw
Date:      2019-05-24 10:28 -0700
URL:       http://hg.openjdk.java.net/valhalla/valhalla/rev/4ccc8d8bc02b

8223658: Performance regression of XML.validation in 13-b19
Reviewed-by: lancea

! src/java.xml/share/classes/com/sun/org/apache/xerces/internal/dom/DeferredDocumentImpl.java

Changeset: 4947a097db60
Author:    lancea
Date:      2019-05-24 15:06 -0400
URL:       http://hg.openjdk.java.net/valhalla/valhalla/rev/4947a097db60

8224682: Remove the com.sun.CORBA.ORBIorTypeCheckRegistryFilter security property
Reviewed-by: bchristi

! src/java.base/share/conf/security/java.security
! test/lib/jdk/test/lib/security/JDKSecurityProperties.java

Changeset: 0627b8ad33c1
Author:    weijun
Date:      2019-05-25 08:30 +0800
URL:       http://hg.openjdk.java.net/valhalla/valhalla/rev/0627b8ad33c1

6682540: Incorrect SASL DIGEST-MD5 behavior
Reviewed-by: jnimeh

! src/java.security.sasl/share/classes/com/sun/security/sasl/digest/DigestMD5Server.java
+ test/jdk/com/sun/security/sasl/digest/HasInitialResponse.java

Changeset: 18f94e911c55
Author:    sspitsyn
Date:      2019-05-24 21:05 -0700
URL:       http://hg.openjdk.java.net/valhalla/valhalla/rev/18f94e911c55

8046018: JVMTI Spec: can_redefine_any_class capability spec is inconsistent
Summary: Make the "can_redefine_any_class" capability spec clear and consistent
Reviewed-by: alanb, cjplummer, dholmes, dcubed, jcbeyler

! src/hotspot/share/prims/jvmti.xml

Changeset: 6264783438f6
Author:    clanger
Date:      2019-05-25 10:54 +0100
URL:       http://hg.openjdk.java.net/valhalla/valhalla/rev/6264783438f6

8224727: Problem list test security/infra/java/security/cert/CertPathValidator/certification/ActalisCA.java
Reviewed-by: rhalade

! test/jdk/ProblemList.txt

Changeset: d871ce8ab96b
Author:    ysuenaga
Date:      2019-05-25 20:55 +0900
URL:       http://hg.openjdk.java.net/valhalla/valhalla/rev/d871ce8ab96b

8224252: [TESTBUG] hotspot/test/serviceability/sa/sadebugd/SADebugDTest.java is timing out again after fix for JDK-8163805
Reviewed-by: cjplummer, sspitsyn

! test/hotspot/jtreg/serviceability/sa/sadebugd/SADebugDTest.java

Changeset: d3afe760b392
Author:    mbaesken
Date:      2019-05-23 15:15 +0200
URL:       http://hg.openjdk.java.net/valhalla/valhalla/rev/d3afe760b392

8224221: add memprotect calls to event log
Reviewed-by: dholmes, mdoerr

! src/hotspot/os/aix/os_aix.cpp
! src/hotspot/os/bsd/os_bsd.cpp
! src/hotspot/os/linux/os_linux.cpp
! src/hotspot/os/solaris/os_solaris.cpp
! src/hotspot/share/runtime/globals.hpp
! src/hotspot/share/utilities/events.hpp

Changeset: 3a8433d967ea
Author:    aefimov
Date:      2019-05-27 13:29 +0100
URL:       http://hg.openjdk.java.net/valhalla/valhalla/rev/3a8433d967ea

8224035: Replace wildcard address with loopback or local host in tests - part 9
Reviewed-by: dfuchs

! test/jdk/java/net/ServerSocket/ThreadStop.java
! test/jdk/java/net/Socket/asyncClose/Race.java
! test/jdk/java/net/URLClassLoader/HttpTest.java
! test/jdk/java/net/URLConnection/TimeoutTest.java
! test/jdk/sun/net/www/http/HttpClient/CookieHttpClientTest.java
! test/jdk/sun/net/www/protocol/http/HttpInputStream.java
! test/jdk/sun/net/www/protocol/http/HttpStreams.java
! test/jdk/sun/net/www/protocol/http/RedirectOnPost.java
! test/jdk/sun/net/www/protocol/http/SetChunkedStreamingMode.java
! test/jdk/sun/net/www/protocol/http/SetIfModifiedSince.java

Changeset: 7f03c3e42628
Author:    rkennke
Date:      2019-05-27 14:57 +0200
URL:       http://hg.openjdk.java.net/valhalla/valhalla/rev/7f03c3e42628

8224836: Backout: JDK-8224626: Shenandoah: Elide barriers on uncommon traps
Reviewed-by: shade

! src/hotspot/share/gc/shenandoah/c2/shenandoahSupport.cpp

Changeset: 3131927311ee
Author:    dfuchs
Date:      2019-05-27 19:24 +0100
URL:       http://hg.openjdk.java.net/valhalla/valhalla/rev/3131927311ee

8224761: Replace wildcard address with loopback or local host in tests - part 12
Summary: fixes a batch of intermittent failures.
Reviewed-by: chegar, vtewari

! test/jdk/com/sun/net/httpserver/Test6a.java
! test/jdk/java/net/MulticastSocket/UnreferencedMulticastSockets.java
! test/jdk/java/net/ProxySelector/ProxyTest.java
! test/jdk/java/net/ResponseCache/Test.java
! test/jdk/java/net/URLConnection/ZeroContentLength.java
! test/jdk/sun/net/www/http/HttpClient/B6726695.java
! test/jdk/sun/net/www/http/KeepAliveStream/InfiniteLoop.java
! test/jdk/sun/net/www/protocol/http/HttpOnly.java
! test/jdk/sun/net/www/protocol/https/HttpsURLConnection/HttpsCreateSockTest.java
! test/lib/jdk/test/lib/NetworkConfiguration.java

Changeset: 812212323fb1
Author:    zgu
Date:      2019-05-27 14:34 -0400
URL:       http://hg.openjdk.java.net/valhalla/valhalla/rev/812212323fb1

8224751: Shenandoah: Shenandoah Verifier should select proper roots according to current GC cycle
Reviewed-by: rkennke

! src/hotspot/share/gc/shenandoah/shenandoahRootVerifier.cpp
! src/hotspot/share/gc/shenandoah/shenandoahRootVerifier.hpp
! src/hotspot/share/gc/shenandoah/shenandoahVerifier.cpp

Changeset: 4853b1ceb3d6
Author:    iignatyev
Date:      2019-05-27 19:46 -0700
URL:       http://hg.openjdk.java.net/valhalla/valhalla/rev/4853b1ceb3d6

8222414: bring googlemock v1.8.1
Reviewed-by: erikj, rwestberg

! make/hotspot/lib/CompileGtest.gmk
- test/fmw/gtest/CHANGES
- test/fmw/gtest/CONTRIBUTORS
- test/fmw/gtest/LICENSE
- test/fmw/gtest/README.md
+ test/fmw/gtest/googlemock/CHANGES
+ test/fmw/gtest/googlemock/CONTRIBUTORS
+ test/fmw/gtest/googlemock/LICENSE
+ test/fmw/gtest/googlemock/README.md
+ test/fmw/gtest/googlemock/include/gmock/gmock-actions.h
+ test/fmw/gtest/googlemock/include/gmock/gmock-cardinalities.h
+ test/fmw/gtest/googlemock/include/gmock/gmock-generated-actions.h
+ test/fmw/gtest/googlemock/include/gmock/gmock-generated-actions.h.pump
+ test/fmw/gtest/googlemock/include/gmock/gmock-generated-function-mockers.h
+ test/fmw/gtest/googlemock/include/gmock/gmock-generated-function-mockers.h.pump
+ test/fmw/gtest/googlemock/include/gmock/gmock-generated-matchers.h
+ test/fmw/gtest/googlemock/include/gmock/gmock-generated-matchers.h.pump
+ test/fmw/gtest/googlemock/include/gmock/gmock-generated-nice-strict.h
+ test/fmw/gtest/googlemock/include/gmock/gmock-generated-nice-strict.h.pump
+ test/fmw/gtest/googlemock/include/gmock/gmock-matchers.h
+ test/fmw/gtest/googlemock/include/gmock/gmock-more-actions.h
+ test/fmw/gtest/googlemock/include/gmock/gmock-more-matchers.h
+ test/fmw/gtest/googlemock/include/gmock/gmock-spec-builders.h
+ test/fmw/gtest/googlemock/include/gmock/gmock.h
+ test/fmw/gtest/googlemock/include/gmock/internal/custom/README.md
+ test/fmw/gtest/googlemock/include/gmock/internal/custom/gmock-generated-actions.h
+ test/fmw/gtest/googlemock/include/gmock/internal/custom/gmock-generated-actions.h.pump
+ test/fmw/gtest/googlemock/include/gmock/internal/custom/gmock-matchers.h
+ test/fmw/gtest/googlemock/include/gmock/internal/custom/gmock-port.h
+ test/fmw/gtest/googlemock/include/gmock/internal/gmock-generated-internal-utils.h
+ test/fmw/gtest/googlemock/include/gmock/internal/gmock-generated-internal-utils.h.pump
+ test/fmw/gtest/googlemock/include/gmock/internal/gmock-internal-utils.h
+ test/fmw/gtest/googlemock/include/gmock/internal/gmock-port.h
+ test/fmw/gtest/googlemock/src/gmock-all.cc
+ test/fmw/gtest/googlemock/src/gmock-cardinalities.cc
+ test/fmw/gtest/googlemock/src/gmock-internal-utils.cc
+ test/fmw/gtest/googlemock/src/gmock-matchers.cc
+ test/fmw/gtest/googlemock/src/gmock-spec-builders.cc
+ test/fmw/gtest/googlemock/src/gmock.cc
+ test/fmw/gtest/googlemock/src/gmock_main.cc
+ test/fmw/gtest/googletest/CHANGES
+ test/fmw/gtest/googletest/CONTRIBUTORS
+ test/fmw/gtest/googletest/LICENSE
+ test/fmw/gtest/googletest/README.md
+ test/fmw/gtest/googletest/include/gtest/gtest-death-test.h
+ test/fmw/gtest/googletest/include/gtest/gtest-message.h
+ test/fmw/gtest/googletest/include/gtest/gtest-param-test.h
+ test/fmw/gtest/googletest/include/gtest/gtest-param-test.h.pump
+ test/fmw/gtest/googletest/include/gtest/gtest-printers.h
+ test/fmw/gtest/googletest/include/gtest/gtest-spi.h
+ test/fmw/gtest/googletest/include/gtest/gtest-test-part.h
+ test/fmw/gtest/googletest/include/gtest/gtest-typed-test.h
+ test/fmw/gtest/googletest/include/gtest/gtest.h
+ test/fmw/gtest/googletest/include/gtest/gtest_pred_impl.h
+ test/fmw/gtest/googletest/include/gtest/gtest_prod.h
+ test/fmw/gtest/googletest/include/gtest/internal/custom/README.md
+ test/fmw/gtest/googletest/include/gtest/internal/custom/gtest-port.h
+ test/fmw/gtest/googletest/include/gtest/internal/custom/gtest-printers.h
+ test/fmw/gtest/googletest/include/gtest/internal/custom/gtest.h
+ test/fmw/gtest/googletest/include/gtest/internal/gtest-death-test-internal.h
+ test/fmw/gtest/googletest/include/gtest/internal/gtest-filepath.h
+ test/fmw/gtest/googletest/include/gtest/internal/gtest-internal.h
+ test/fmw/gtest/googletest/include/gtest/internal/gtest-linked_ptr.h
+ test/fmw/gtest/googletest/include/gtest/internal/gtest-param-util-generated.h
+ test/fmw/gtest/googletest/include/gtest/internal/gtest-param-util-generated.h.pump
+ test/fmw/gtest/googletest/include/gtest/internal/gtest-param-util.h
+ test/fmw/gtest/googletest/include/gtest/internal/gtest-port-arch.h
+ test/fmw/gtest/googletest/include/gtest/internal/gtest-port.h
+ test/fmw/gtest/googletest/include/gtest/internal/gtest-string.h
+ test/fmw/gtest/googletest/include/gtest/internal/gtest-tuple.h
+ test/fmw/gtest/googletest/include/gtest/internal/gtest-tuple.h.pump
+ test/fmw/gtest/googletest/include/gtest/internal/gtest-type-util.h
+ test/fmw/gtest/googletest/include/gtest/internal/gtest-type-util.h.pump
+ test/fmw/gtest/googletest/src/gtest-all.cc
+ test/fmw/gtest/googletest/src/gtest-death-test.cc
+ test/fmw/gtest/googletest/src/gtest-filepath.cc
+ test/fmw/gtest/googletest/src/gtest-internal-inl.h
+ test/fmw/gtest/googletest/src/gtest-port.cc
+ test/fmw/gtest/googletest/src/gtest-printers.cc
+ test/fmw/gtest/googletest/src/gtest-test-part.cc
+ test/fmw/gtest/googletest/src/gtest-typed-test.cc
+ test/fmw/gtest/googletest/src/gtest.cc
+ test/fmw/gtest/googletest/src/gtest_main.cc
- test/fmw/gtest/include/gtest/gtest-death-test.h
- test/fmw/gtest/include/gtest/gtest-message.h
- test/fmw/gtest/include/gtest/gtest-param-test.h
- test/fmw/gtest/include/gtest/gtest-param-test.h.pump
- test/fmw/gtest/include/gtest/gtest-printers.h
- test/fmw/gtest/include/gtest/gtest-spi.h
- test/fmw/gtest/include/gtest/gtest-test-part.h
- test/fmw/gtest/include/gtest/gtest-typed-test.h
- test/fmw/gtest/include/gtest/gtest.h
- test/fmw/gtest/include/gtest/gtest_pred_impl.h
- test/fmw/gtest/include/gtest/gtest_prod.h
- test/fmw/gtest/include/gtest/internal/custom/README.md
- test/fmw/gtest/include/gtest/internal/custom/gtest-port.h
- test/fmw/gtest/include/gtest/internal/custom/gtest-printers.h
- test/fmw/gtest/include/gtest/internal/custom/gtest.h
- test/fmw/gtest/include/gtest/internal/gtest-death-test-internal.h
- test/fmw/gtest/include/gtest/internal/gtest-filepath.h
- test/fmw/gtest/include/gtest/internal/gtest-internal.h
- test/fmw/gtest/include/gtest/internal/gtest-linked_ptr.h
- test/fmw/gtest/include/gtest/internal/gtest-param-util-generated.h
- test/fmw/gtest/include/gtest/internal/gtest-param-util-generated.h.pump
- test/fmw/gtest/include/gtest/internal/gtest-param-util.h
- test/fmw/gtest/include/gtest/internal/gtest-port-arch.h
- test/fmw/gtest/include/gtest/internal/gtest-port.h
- test/fmw/gtest/include/gtest/internal/gtest-string.h
- test/fmw/gtest/include/gtest/internal/gtest-tuple.h
- test/fmw/gtest/include/gtest/internal/gtest-tuple.h.pump
- test/fmw/gtest/include/gtest/internal/gtest-type-util.h
- test/fmw/gtest/include/gtest/internal/gtest-type-util.h.pump
- test/fmw/gtest/src/gtest-all.cc
- test/fmw/gtest/src/gtest-death-test.cc
- test/fmw/gtest/src/gtest-filepath.cc
- test/fmw/gtest/src/gtest-internal-inl.h
- test/fmw/gtest/src/gtest-port.cc
- test/fmw/gtest/src/gtest-printers.cc
- test/fmw/gtest/src/gtest-test-part.cc
- test/fmw/gtest/src/gtest-typed-test.cc
- test/fmw/gtest/src/gtest.cc
- test/fmw/gtest/src/gtest_main.cc
! test/hotspot/gtest/gtestMain.cpp
! test/hotspot/gtest/unittest.hpp

Changeset: feba48c5dfb4
Author:    rraghavan
Date:      2019-05-28 12:01 +0530
URL:       http://hg.openjdk.java.net/valhalla/valhalla/rev/feba48c5dfb4

8213416: Replace some enums with static const members in hotspot/compiler
Summary: Changes to fix enumeral and non-enumeral type in conditional expression warnings with -Wextra for gcc on hotspot
Reviewed-by: kvn, thartmann

! src/hotspot/share/ci/ciReplay.cpp
! src/hotspot/share/opto/machnode.hpp
! src/hotspot/share/opto/node.hpp

Changeset: fb9758536458
Author:    lucy
Date:      2019-05-28 09:41 +0200
URL:       http://hg.openjdk.java.net/valhalla/valhalla/rev/fb9758536458

8224672: (lib)hsdis-<arch>.so search incorrect after JDK-8213084
Reviewed-by: kvn, shade

! src/hotspot/share/compiler/disassembler.cpp

Changeset: 05a408cbd945
Author:    coleenp
Date:      2019-05-28 06:42 -0400
URL:       http://hg.openjdk.java.net/valhalla/valhalla/rev/05a408cbd945

8220688: [TESTBUG] runtime/NMT/MallocStressTest.java timed out
Summary: reduce number of threads and iterate rather than sleep.
Reviewed-by: zgu, dholmes

! test/hotspot/jtreg/runtime/NMT/MallocStressTest.java

Changeset: d58e1a447d2b
Author:    mgronlun
Date:      2019-05-28 13:28 +0200
URL:       http://hg.openjdk.java.net/valhalla/valhalla/rev/d58e1a447d2b

8221121: applications/microbenchmarks are encountering crashes in tier5
Reviewed-by: egahlin, dholmes

! src/hotspot/share/jfr/recorder/storage/jfrBuffer.cpp
! src/hotspot/share/jfr/recorder/storage/jfrBuffer.hpp
! src/hotspot/share/jfr/recorder/storage/jfrStorage.cpp

Changeset: 78e49883146f
Author:    aph
Date:      2019-05-23 07:57 -0400
URL:       http://hg.openjdk.java.net/valhalla/valhalla/rev/78e49883146f

8224671: AArch64: mauve System.arraycopy test failure
Reviewed-by: adinn

! src/hotspot/cpu/aarch64/assembler_aarch64.hpp
! src/hotspot/cpu/aarch64/c1_LIRAssembler_aarch64.cpp

Changeset: 755f1c66a891
Author:    aph
Date:      2019-05-28 08:25 -0400
URL:       http://hg.openjdk.java.net/valhalla/valhalla/rev/755f1c66a891

Merge

- src/hotspot/share/c1/c1_globals.cpp
- src/hotspot/share/opto/c2_globals.cpp
- src/java.base/share/classes/sun/text/resources/nfc.icu
- src/java.base/share/classes/sun/text/resources/nfkc.icu
- src/java.base/share/classes/sun/text/resources/nfkc_cf.icu
- test/fmw/gtest/CHANGES
- test/fmw/gtest/CONTRIBUTORS
- test/fmw/gtest/LICENSE
- test/fmw/gtest/README.md
- test/fmw/gtest/include/gtest/gtest-death-test.h
- test/fmw/gtest/include/gtest/gtest-message.h
- test/fmw/gtest/include/gtest/gtest-param-test.h
- test/fmw/gtest/include/gtest/gtest-param-test.h.pump
- test/fmw/gtest/include/gtest/gtest-printers.h
- test/fmw/gtest/include/gtest/gtest-spi.h
- test/fmw/gtest/include/gtest/gtest-test-part.h
- test/fmw/gtest/include/gtest/gtest-typed-test.h
- test/fmw/gtest/include/gtest/gtest.h
- test/fmw/gtest/include/gtest/gtest_pred_impl.h
- test/fmw/gtest/include/gtest/gtest_prod.h
- test/fmw/gtest/include/gtest/internal/custom/README.md
- test/fmw/gtest/include/gtest/internal/custom/gtest-port.h
- test/fmw/gtest/include/gtest/internal/custom/gtest-printers.h
- test/fmw/gtest/include/gtest/internal/custom/gtest.h
- test/fmw/gtest/include/gtest/internal/gtest-death-test-internal.h
- test/fmw/gtest/include/gtest/internal/gtest-filepath.h
- test/fmw/gtest/include/gtest/internal/gtest-internal.h
- test/fmw/gtest/include/gtest/internal/gtest-linked_ptr.h
- test/fmw/gtest/include/gtest/internal/gtest-param-util-generated.h
- test/fmw/gtest/include/gtest/internal/gtest-param-util-generated.h.pump
- test/fmw/gtest/include/gtest/internal/gtest-param-util.h
- test/fmw/gtest/include/gtest/internal/gtest-port-arch.h
- test/fmw/gtest/include/gtest/internal/gtest-port.h
- test/fmw/gtest/include/gtest/internal/gtest-string.h
- test/fmw/gtest/include/gtest/internal/gtest-tuple.h
- test/fmw/gtest/include/gtest/internal/gtest-tuple.h.pump
- test/fmw/gtest/include/gtest/internal/gtest-type-util.h
- test/fmw/gtest/include/gtest/internal/gtest-type-util.h.pump
- test/fmw/gtest/src/gtest-all.cc
- test/fmw/gtest/src/gtest-death-test.cc
- test/fmw/gtest/src/gtest-filepath.cc
- test/fmw/gtest/src/gtest-internal-inl.h
- test/fmw/gtest/src/gtest-port.cc
- test/fmw/gtest/src/gtest-printers.cc
- test/fmw/gtest/src/gtest-test-part.cc
- test/fmw/gtest/src/gtest-typed-test.cc
- test/fmw/gtest/src/gtest.cc
- test/fmw/gtest/src/gtest_main.cc
- test/jdk/java/lang/Character/PropList.txt
- test/jdk/java/lang/Character/PropertyValueAliases.txt
- test/jdk/java/lang/Character/Scripts.txt
- test/jdk/java/lang/Character/SpecialCasing.txt
- test/jdk/java/lang/Character/UnicodeBlock/Blocks.txt
- test/jdk/java/lang/Character/UnicodeData.txt
- test/jdk/java/lang/Character/charprop00.bin
- test/jdk/java/lang/Character/charprop01.bin
- test/jdk/java/lang/Character/charprop02.bin
- test/jdk/java/lang/Character/charprop03.bin
- test/jdk/java/lang/Character/charprop0E.bin
- test/jdk/java/lang/Character/charprop0F.bin
- test/jdk/java/lang/Character/charprop10.bin
- test/jdk/java/util/regex/GraphemeBreakProperty.txt
- test/jdk/java/util/regex/GraphemeBreakTest.txt
- test/jdk/sun/management/windows/revokeall.c
- test/jdk/sun/management/windows/revokeall.exe

Changeset: 146f257274c9
Author:    thartmann
Date:      2019-05-28 14:53 +0200
URL:       http://hg.openjdk.java.net/valhalla/valhalla/rev/146f257274c9

8224870: Problemlist compiler/c2/Test8004741.java until JDK-8214904 is fixed
Summary: Added Test8004741 to problem list.
Reviewed-by: shade

! test/hotspot/jtreg/ProblemList.txt

Changeset: 63ab89cc3e69
Author:    sundar
Date:      2019-05-28 19:30 +0530
URL:       http://hg.openjdk.java.net/valhalla/valhalla/rev/63ab89cc3e69

8216553: JrtFIleSystemProvider getPath(URI) omits /modules element from file path
Reviewed-by: alanb, jlaskey

! src/java.base/share/classes/jdk/internal/jrtfs/JrtFileSystemProvider.java
! src/java.base/share/classes/jdk/internal/jrtfs/JrtPath.java
! test/jdk/jdk/internal/jrtfs/Basic.java
! test/langtools/tools/lib/toolbox/JarTask.java

Changeset: 30094911fffd
Author:    aph
Date:      2019-05-28 09:13 -0400
URL:       http://hg.openjdk.java.net/valhalla/valhalla/rev/30094911fffd

8224880: AArch64: java/javac error with AllocatePrefetchDistance
Reviewed-by: adinn

! src/hotspot/cpu/aarch64/vm_version_aarch64.cpp

Changeset: 0422b4b5cb8e
Author:    aph
Date:      2019-05-28 10:20 -0400
URL:       http://hg.openjdk.java.net/valhalla/valhalla/rev/0422b4b5cb8e

Merge


Changeset: b5ca5b98037b
Author:    ccheung
Date:      2019-05-28 09:40 -0700
URL:       http://hg.openjdk.java.net/valhalla/valhalla/rev/b5ca5b98037b

8224548: [TESTBUG] runtime/appcds/jvmti/ClassFileLoadHookTest.java failed: must be shared
Summary: improve the -Xshare:auto case
Reviewed-by: iklam, coleenp

! test/hotspot/jtreg/runtime/appcds/jvmti/ClassFileLoadHook.java
! test/hotspot/jtreg/runtime/appcds/jvmti/ClassFileLoadHookTest.java

Changeset: d1fa0f8d8c9a
Author:    vdeshpande
Date:      2019-05-28 09:56 -0700
URL:       http://hg.openjdk.java.net/valhalla/valhalla/rev/d1fa0f8d8c9a

8224558: Fix replicateB encoding
Reviewed-by: thartmann, vlivanov

! src/hotspot/cpu/x86/x86.ad

Changeset: 45128070fd15
Author:    darcy
Date:      2019-05-28 10:54 -0700
URL:       http://hg.openjdk.java.net/valhalla/valhalla/rev/45128070fd15

8224783: Javadoc of String strip methods uses link where linkplain would be better
Reviewed-by: lancea, jlaskey

! src/java.base/share/classes/java/lang/String.java

Changeset: 51c699875f7c
Author:    coffeys
Date:      2019-05-28 19:19 +0100
URL:       http://hg.openjdk.java.net/valhalla/valhalla/rev/51c699875f7c

8042904: apple.security.KeychainStore.getSalt() calling generateSeed()
Reviewed-by: jnimeh

! src/java.base/macosx/classes/apple/security/KeychainStore.java

Changeset: cb35ce1770a0
Author:    jjg
Date:      2019-05-28 11:21 -0700
URL:       http://hg.openjdk.java.net/valhalla/valhalla/rev/cb35ce1770a0

8219147: Javadoc should expose covariant return type overrides
Reviewed-by: hannesw

! src/jdk.javadoc/share/classes/jdk/javadoc/internal/doclets/toolkit/util/VisibleMemberTable.java
! test/langtools/jdk/javadoc/doclet/testOverriddenMethods/TestOverrideMethods.java
+ test/langtools/jdk/javadoc/doclet/testOverriddenMethods/pkg6/Base.java
+ test/langtools/jdk/javadoc/doclet/testOverriddenMethods/pkg6/Sub.java

Changeset: 103f9068c39f
Author:    jjg
Date:      2019-05-28 11:22 -0700
URL:       http://hg.openjdk.java.net/valhalla/valhalla/rev/103f9068c39f

Merge


Changeset: b9d1e2fbe51d
Author:    mullan
Date:      2019-05-28 14:28 -0400
URL:       http://hg.openjdk.java.net/valhalla/valhalla/rev/b9d1e2fbe51d

8224885: ProblemList sun/security/tools/keytool/KeyToolTest.java and WeakAlgTest.java on Solaris
Reviewed-by: xuelei

! test/jdk/ProblemList.txt

Changeset: 52a1bebd1355
Author:    mullan
Date:      2019-05-28 14:29 -0400
URL:       http://hg.openjdk.java.net/valhalla/valhalla/rev/52a1bebd1355

Merge


Changeset: f6260463dbe4
Author:    rehn
Date:      2019-05-28 20:47 +0200
URL:       http://hg.openjdk.java.net/valhalla/valhalla/rev/f6260463dbe4

8224795: some runtime/SelectionResolution tests are timing out
Reviewed-by: dholmes, thartmann

! src/hotspot/share/code/nmethod.cpp

Changeset: 6e0786d8451b
Author:    shade
Date:      2019-05-28 21:31 +0200
URL:       http://hg.openjdk.java.net/valhalla/valhalla/rev/6e0786d8451b

8224796: C code is not compiled correctly due to undefined "i386"
Reviewed-by: dholmes, mikael

! src/jdk.hotspot.agent/linux/native/libsaproc/LinuxDebuggerLocal.c
! src/jdk.hotspot.agent/macosx/native/libsaproc/ps_core.c

Changeset: d850d0f41c72
Author:    jlaskey
Date:      2019-05-28 16:51 -0300
URL:       http://hg.openjdk.java.net/valhalla/valhalla/rev/d850d0f41c72

8224908: Revert: 8216553: JrtFileSystemProvider getPath(URI) omits /modules element from file path
Reviewed-by: darcy, kbarrett

! src/java.base/share/classes/jdk/internal/jrtfs/JrtFileSystemProvider.java
! src/java.base/share/classes/jdk/internal/jrtfs/JrtPath.java
! test/jdk/jdk/internal/jrtfs/Basic.java
! test/langtools/tools/lib/toolbox/JarTask.java

Changeset: 4e62485d2b18
Author:    rraghavan
Date:      2019-05-29 07:49 +0530
URL:       http://hg.openjdk.java.net/valhalla/valhalla/rev/4e62485d2b18

8220449: serviceability/dcmd/compiler/CodelistTest.java failure
Summary: Added -XX:-BackgroundCompilation to test to eager initialize JVMCI
Reviewed-by: gadams, thartmann

! test/hotspot/jtreg/serviceability/dcmd/compiler/CodelistTest.java

Changeset: d0f73fccf5f3
Author:    mbalao
Date:      2019-05-28 19:01 -0300
URL:       http://hg.openjdk.java.net/valhalla/valhalla/rev/d0f73fccf5f3

8223482: Unsupported ciphersuites may be offered by a TLS client
Reviewed-by: xuelei

! src/java.base/share/classes/sun/security/ssl/SSLCipher.java
! src/java.base/share/classes/sun/security/ssl/SSLContextImpl.java
! test/jdk/sun/security/pkcs11/tls/tls12/FipsModeTLS12.java

Changeset: f4702c8c9b3f
Author:    ysuenaga
Date:      2019-05-29 13:50 +0900
URL:       http://hg.openjdk.java.net/valhalla/valhalla/rev/f4702c8c9b3f

8223814: SA: jhsdb common help needs to be more detailed
Reviewed-by: dholmes, sspitsyn, ysuenaga
Contributed-by: Osamu Sakamoto <sakamoto.osamu at nttcom.co.jp>

! src/jdk.hotspot.agent/share/classes/sun/jvm/hotspot/SALauncher.java

Changeset: ea1e4a818785
Author:    mbaesken
Date:      2019-05-24 14:32 +0200
URL:       http://hg.openjdk.java.net/valhalla/valhalla/rev/ea1e4a818785

8224750: Display thread once in Internal exceptions event log lines
Reviewed-by: mdoerr

! src/hotspot/share/utilities/events.cpp

Changeset: 044f2ca6ce22
Author:    stefank
Date:      2019-05-29 09:25 +0200
URL:       http://hg.openjdk.java.net/valhalla/valhalla/rev/044f2ca6ce22

8223392: Add missing BitMap comments for JDK-8222986
Reviewed-by: tschatzl, pliden

! src/hotspot/share/utilities/bitMap.cpp
! src/hotspot/share/utilities/bitMap.hpp

Changeset: 785a12e0f89b
Author:    rkennke
Date:      2019-05-29 12:01 +0200
URL:       http://hg.openjdk.java.net/valhalla/valhalla/rev/785a12e0f89b

8224584: Shenandoah: Eliminate forwarding pointer word
Reviewed-by: shade, roland

! src/hotspot/cpu/aarch64/gc/shenandoah/shenandoahBarrierSetAssembler_aarch64.cpp
! src/hotspot/cpu/aarch64/gc/shenandoah/shenandoahBarrierSetAssembler_aarch64.hpp
! src/hotspot/cpu/x86/gc/shenandoah/shenandoahBarrierSetAssembler_x86.cpp
! src/hotspot/cpu/x86/gc/shenandoah/shenandoahBarrierSetAssembler_x86.hpp
! src/hotspot/share/gc/shenandoah/c2/shenandoahBarrierSetC2.cpp
! src/hotspot/share/gc/shenandoah/c2/shenandoahBarrierSetC2.hpp
! src/hotspot/share/gc/shenandoah/c2/shenandoahSupport.cpp
! src/hotspot/share/gc/shenandoah/shenandoahAsserts.cpp
! src/hotspot/share/gc/shenandoah/shenandoahBarrierSet.cpp
! src/hotspot/share/gc/shenandoah/shenandoahConcurrentMark.inline.hpp
! src/hotspot/share/gc/shenandoah/shenandoahForwarding.hpp
! src/hotspot/share/gc/shenandoah/shenandoahForwarding.inline.hpp
! src/hotspot/share/gc/shenandoah/shenandoahHeap.cpp
! src/hotspot/share/gc/shenandoah/shenandoahHeap.hpp
! src/hotspot/share/gc/shenandoah/shenandoahHeap.inline.hpp
! src/hotspot/share/gc/shenandoah/shenandoahHeapRegion.cpp
! src/hotspot/share/gc/shenandoah/shenandoahHeuristics.cpp
! src/hotspot/share/gc/shenandoah/shenandoahMarkCompact.cpp
! src/hotspot/share/gc/shenandoah/shenandoahMarkCompact.hpp
! src/hotspot/share/gc/shenandoah/shenandoahTraversalGC.cpp
! src/hotspot/share/gc/shenandoah/shenandoahVerifier.cpp

Changeset: 806b1c8e24b8
Author:    hannesw
Date:      2019-05-29 12:43 +0200
URL:       http://hg.openjdk.java.net/valhalla/valhalla/rev/806b1c8e24b8

8222318: javadoc does not accept valid HTML5 entity names
Reviewed-by: jjg

! src/jdk.compiler/share/classes/com/sun/tools/doclint/Entity.java

Changeset: e63a624da347
Author:    mgronlun
Date:      2019-05-29 13:30 +0200
URL:       http://hg.openjdk.java.net/valhalla/valhalla/rev/e63a624da347

8217089: JFR: Lazy install os interface components for improved startup
Reviewed-by: dholmes, egahlin

! src/hotspot/share/jfr/periodic/jfrOSInterface.cpp

Changeset: de371e2d1acc
Author:    roland
Date:      2019-05-22 10:11 +0200
URL:       http://hg.openjdk.java.net/valhalla/valhalla/rev/de371e2d1acc

8224496: Shenandoah compilation fails with assert(is_CountedLoopEnd()) failed: invalid node class
Reviewed-by: rkennke

! src/hotspot/share/gc/shenandoah/c2/shenandoahSupport.cpp

Changeset: ef713640430e
Author:    hseigel
Date:      2019-05-29 08:21 -0400
URL:       http://hg.openjdk.java.net/valhalla/valhalla/rev/ef713640430e

8224763: Update man pages to show deprecation of -Xverify:none
Summary: Add the appropriate deprecation text
Reviewed-by: dholmes, lfoltan

! src/java.base/share/classes/sun/launcher/resources/launcher.properties
! src/java.base/share/man/java.1
! src/java.base/share/native/libjli/java.c

Changeset: dd321e3596c0
Author:    chegar
Date:      2019-05-29 13:58 +0100
URL:       http://hg.openjdk.java.net/valhalla/valhalla/rev/dd321e3596c0

8224477: java.net socket types new-style socket option methods - spec and impl mismatch
Reviewed-by: alanb

! src/java.base/share/classes/java/net/AbstractPlainDatagramSocketImpl.java
! src/java.base/share/classes/java/net/AbstractPlainSocketImpl.java
! src/java.base/share/classes/java/net/DatagramSocket.java
! src/java.base/share/classes/java/net/DatagramSocketImpl.java
! src/java.base/share/classes/java/net/ServerSocket.java
! src/java.base/share/classes/java/net/Socket.java
! src/java.base/share/classes/java/net/SocketImpl.java
! src/java.base/share/classes/sun/nio/ch/DatagramChannelImpl.java
! src/java.base/share/classes/sun/nio/ch/ServerSocketChannelImpl.java
! src/java.base/share/classes/sun/nio/ch/SocketChannelImpl.java
! src/java.base/unix/classes/java/net/PlainDatagramSocketImpl.java
! src/java.base/unix/classes/java/net/PlainSocketImpl.java
+ test/jdk/java/net/DatagramSocketImpl/TestDefaultBehavior.java
+ test/jdk/java/net/SocketImpl/TestDefaultBehavior.java
+ test/jdk/java/net/SocketOption/AfterClose.java
+ test/jdk/java/net/SocketOption/NullsAndBadValues.java
! test/jdk/java/net/SocketOption/OptionsTest.java
! test/jdk/java/net/SocketOption/UnsupportedOptionsTest.java

Changeset: 335f474becde
Author:    shade
Date:      2019-05-29 15:25 +0200
URL:       http://hg.openjdk.java.net/valhalla/valhalla/rev/335f474becde

8224970: ShenandoahRootScanner::roots_do assert is too strong
Reviewed-by: zgu

! src/hotspot/share/gc/shenandoah/shenandoahRootProcessor.inline.hpp

Changeset: 2fc6027f0eed
Author:    zgu
Date:      2019-05-29 09:43 -0400
URL:       http://hg.openjdk.java.net/valhalla/valhalla/rev/2fc6027f0eed

8224932: Shenandoah: Rename ShenandoahHeapLock, make it general purpose lock
Reviewed-by: shade

! src/hotspot/share/gc/shenandoah/shenandoahHeap.hpp
- src/hotspot/share/gc/shenandoah/shenandoahHeapLock.hpp
+ src/hotspot/share/gc/shenandoah/shenandoahLock.hpp

Changeset: a8e2e273c943
Author:    hannesw
Date:      2019-05-29 15:52 +0200
URL:       http://hg.openjdk.java.net/valhalla/valhalla/rev/a8e2e273c943

8224982: JDK-8222318 breaks tools/doclint/html/EntitiesTest.java
Reviewed-by: sundar

! src/jdk.compiler/share/classes/com/sun/tools/doclint/Entity.java

Changeset: bda9984d8ee4
Author:    xuelei
Date:      2019-05-29 06:56 -0700
URL:       http://hg.openjdk.java.net/valhalla/valhalla/rev/bda9984d8ee4

8224981: Problemlist test/jdk/sun/security/pkcs11/tls/tls12/FipsModeTLS12.java
Reviewed-by: mullan

! test/jdk/ProblemList.txt

Changeset: dcda4663a926
Author:    xuelei
Date:      2019-05-29 07:48 -0700
URL:       http://hg.openjdk.java.net/valhalla/valhalla/rev/dcda4663a926

8224984: Problemlist javax/net/ssl/SSLSocket/Tls13PacketSize.java
Reviewed-by: mullan

! test/jdk/ProblemList.txt

Changeset: 82fe7292ca5c
Author:    gromero
Date:      2019-05-22 12:17 -0400
URL:       http://hg.openjdk.java.net/valhalla/valhalla/rev/82fe7292ca5c

8223660: jtreg: Decouple Unsafe from RTM tests
Reviewed-by: mdoerr, shade

! test/hotspot/jtreg/compiler/rtm/locking/TestRTMAbortRatio.java
! test/hotspot/jtreg/compiler/rtm/locking/TestRTMAbortThreshold.java
! test/hotspot/jtreg/compiler/rtm/locking/TestRTMAfterNonRTMDeopt.java
! test/hotspot/jtreg/compiler/rtm/locking/TestRTMDeoptOnHighAbortRatio.java
! test/hotspot/jtreg/compiler/rtm/locking/TestRTMDeoptOnLowAbortRatio.java
! test/hotspot/jtreg/compiler/rtm/locking/TestRTMLockingCalculationDelay.java
! test/hotspot/jtreg/compiler/rtm/locking/TestRTMLockingThreshold.java
! test/hotspot/jtreg/compiler/rtm/locking/TestRTMTotalCountIncrRate.java
! test/hotspot/jtreg/compiler/rtm/locking/TestUseRTMAfterLockInflation.java
! test/hotspot/jtreg/compiler/rtm/locking/TestUseRTMDeopt.java
! test/hotspot/jtreg/compiler/rtm/locking/TestUseRTMForInflatedLocks.java
! test/hotspot/jtreg/compiler/rtm/locking/TestUseRTMForStackLocks.java
! test/hotspot/jtreg/compiler/rtm/method_options/TestNoRTMLockElidingOption.java
! test/hotspot/jtreg/compiler/rtm/method_options/TestUseRTMLockElidingOption.java
! test/hotspot/jtreg/compiler/rtm/print/TestPrintPreciseRTMLockingStatistics.java
! test/hotspot/jtreg/compiler/testlibrary/rtm/XAbortProvoker.java
+ test/hotspot/jtreg/compiler/testlibrary/rtm/libXAbortProvoker.c

Changeset: 69a35cd74f7d
Author:    weijun
Date:      2019-05-29 23:36 +0800
URL:       http://hg.openjdk.java.net/valhalla/valhalla/rev/69a35cd74f7d

8223053: [xmldsig] Add KeyValue::EC_TYPE
Reviewed-by: mullan

! src/java.xml.crypto/share/classes/javax/xml/crypto/dsig/keyinfo/KeyValue.java

Changeset: 934d68e9c45d
Author:    zgu
Date:      2019-05-29 10:57 -0400
URL:       http://hg.openjdk.java.net/valhalla/valhalla/rev/934d68e9c45d

8224875: Shenandoah: ParallelCleaning code unloading should take lock to protect shared code roots array
Reviewed-by: shade

! src/hotspot/share/gc/shenandoah/shenandoahCodeRoots.cpp
! src/hotspot/share/gc/shenandoah/shenandoahCodeRoots.hpp

Changeset: c1ad2862d0dd
Author:    darcy
Date:      2019-05-29 09:53 -0700
URL:       http://hg.openjdk.java.net/valhalla/valhalla/rev/c1ad2862d0dd

8224012: AnnotatedType implementations of hashCode() lead to StackOverflowError
Reviewed-by: jfranck

! src/java.base/share/classes/sun/reflect/annotation/AnnotatedTypeFactory.java
! test/jdk/java/lang/annotation/typeAnnotations/TestObjectMethods.java

Changeset: c58772f2dbce
Author:    iignatyev
Date:      2019-05-29 11:54 -0700
URL:       http://hg.openjdk.java.net/valhalla/valhalla/rev/c58772f2dbce

8224945: googlemock update breaks the build of arm32 and ppc
Reviewed-by: dholmes, simonis

! test/hotspot/gtest/unittest.hpp

Changeset: b034d2dee5fc
Author:    joehw
Date:      2019-05-29 11:58 -0700
URL:       http://hg.openjdk.java.net/valhalla/valhalla/rev/b034d2dee5fc

8225005: Xerces 2.12.0: License file
Reviewed-by: lancea

! src/java.xml/share/legal/xerces.md

Changeset: b7ac60035a28
Author:    aeubanks
Date:      2019-05-16 15:58 -0700
URL:       http://hg.openjdk.java.net/valhalla/valhalla/rev/b7ac60035a28

8224081: SOCKS v4 doesn't work with IPv6
Reviewed-by: chegar, dfuchs, mullan, vtewari
Contributed-by: aeubanks at google.com

! test/jdk/java/net/Socks/SocksProxyVersion.java
! test/jdk/sun/security/x509/URICertStore/SocksProxy.java

Changeset: 80dd2b549354
Author:    dlong
Date:      2019-05-29 13:31 -0700
URL:       http://hg.openjdk.java.net/valhalla/valhalla/rev/80dd2b549354

8224931: disable JAOTC invokedynamic support until 8223533 is fixed
Reviewed-by: kvn, never

! src/jdk.aot/share/classes/jdk.tools.jaotc/src/jdk/tools/jaotc/Main.java

Changeset: 3e5dba06a663
Author:    xuelei
Date:      2019-05-29 13:39 -0700
URL:       http://hg.openjdk.java.net/valhalla/valhalla/rev/3e5dba06a663

8224991: Problemlist javax/net/ssl/ServerName/SSLEngineExplorerMatchedSNI.java
Reviewed-by: mullan

! test/jdk/ProblemList.txt

Changeset: 234673929e0a
Author:    igerasim
Date:      2019-05-29 13:44 -0700
URL:       http://hg.openjdk.java.net/valhalla/valhalla/rev/234673929e0a

8224789: Parsing repetition count in regex does not detect numeric overflow
Reviewed-by: rriggs, bchristi

! src/java.base/share/classes/java/util/regex/Pattern.java
! test/jdk/java/util/regex/RegExTest.java

Changeset: ae908641e726
Author:    clanger
Date:      2019-05-29 22:30 +0100
URL:       http://hg.openjdk.java.net/valhalla/valhalla/rev/ae908641e726

8224729: Cleanups in sun/security/provider/certpath/ldap/LDAPCertStoreImpl.java
Reviewed-by: mullan

! src/java.naming/share/classes/sun/security/provider/certpath/ldap/LDAPCertStoreImpl.java

Changeset: 609dc5c60c06
Author:    erikj
Date:      2019-05-29 15:29 -0700
URL:       http://hg.openjdk.java.net/valhalla/valhalla/rev/609dc5c60c06

8224011: Failure handling in ExecuteWithLog fails in run-test-prebuilt
Reviewed-by: tbell

! make/RunTests.gmk
! make/RunTestsPrebuilt.gmk

Changeset: a29fa5133004
Author:    dcubed
Date:      2019-05-29 19:25 -0400
URL:       http://hg.openjdk.java.net/valhalla/valhalla/rev/a29fa5133004

8225022: Put compiler/graalunit/JttThreadsTest.java on ProblemList-graal.txt
Reviewed-by: kvn

! test/hotspot/jtreg/ProblemList-graal.txt

Changeset: 8df9bb8d2023
Author:    jwilhelm
Date:      2019-05-30 03:15 +0200
URL:       http://hg.openjdk.java.net/valhalla/valhalla/rev/8df9bb8d2023

Added tag jdk-13+23 for changeset b034d2dee5fc

! .hgtags

Changeset: c41783eb76eb
Author:    dholmes
Date:      2019-05-29 22:17 -0400
URL:       http://hg.openjdk.java.net/valhalla/valhalla/rev/c41783eb76eb

8224790: Remove Xusage.txt file
Reviewed-by: alanb, dcubed, erikj, mchung

! make/hotspot/gensrc/GenerateSources.gmk
- src/hotspot/share/Xusage.txt

Changeset: 59567035d279
Author:    alanb
Date:      2019-05-30 07:19 +0100
URL:       http://hg.openjdk.java.net/valhalla/valhalla/rev/59567035d279

8221481: Reimplement the Legacy Socket API
Reviewed-by: michaelm, chegar

! src/java.base/share/classes/java/net/SocketImpl.java
+ src/java.base/share/classes/sun/nio/ch/NioSocketImpl.java
! test/jdk/ProblemList.txt
! test/jdk/com/sun/net/httpserver/Test1.java
! test/jdk/java/net/ServerSocket/AcceptCauseFileDescriptorLeak.java
! test/jdk/java/net/ServerSocket/UnreferencedSockets.java
! test/jdk/java/net/Socket/ConnectionReset.java
! test/jdk/java/net/Socket/Timeouts.java
! test/jdk/java/net/Socket/UdpSocket.java
! test/jdk/java/net/Socket/asyncClose/AsyncClose.java
+ test/jdk/java/net/SocketImpl/BadUsages.java
+ test/jdk/java/net/SocketImpl/CompareSocketOptions.java
+ test/jdk/java/net/SocketImpl/java.base/java/net/PlatformSocketImpl.java
! test/jdk/java/net/SocketOption/OptionsTest.java
! test/jdk/java/net/ipv6tests/TcpTest.java
! test/jdk/sun/security/ssl/SSLSocketImpl/NewSocketMethods.java

Changeset: 8a1095447ae6
Author:    shade
Date:      2019-05-30 10:21 +0200
URL:       http://hg.openjdk.java.net/valhalla/valhalla/rev/8a1095447ae6

8225017: [TESTBUG] gc/shenandoah/oom/TestThreadFailure.java takes too long
Reviewed-by: rkennke

! test/hotspot/jtreg/gc/shenandoah/oom/TestThreadFailure.java

Changeset: a72e187adb54
Author:    mgronlun
Date:      2019-05-30 11:42 +0200
URL:       http://hg.openjdk.java.net/valhalla/valhalla/rev/a72e187adb54

8224172: assert(jfr_is_event_enabled(id)) failed: invariant
Reviewed-by: dcubed, dholmes

! src/hotspot/share/jfr/support/jfrFlush.cpp

Changeset: 9ad765641e8f
Author:    vlivanov
Date:      2019-05-30 13:39 +0300
URL:       http://hg.openjdk.java.net/valhalla/valhalla/rev/9ad765641e8f

8223213: Implement fast class initialization checks on x86-64
Reviewed-by: kvn, redestad, dholmes, mdoerr, coleenp

! src/hotspot/cpu/aarch64/c1_LIRAssembler_aarch64.cpp
! src/hotspot/cpu/arm/c1_LIRAssembler_arm.cpp
! src/hotspot/cpu/ppc/c1_LIRAssembler_ppc.cpp
! src/hotspot/cpu/s390/c1_LIRAssembler_s390.cpp
! src/hotspot/cpu/sparc/c1_LIRAssembler_sparc.cpp
! src/hotspot/cpu/x86/c1_LIRAssembler_x86.cpp
! src/hotspot/cpu/x86/interp_masm_x86.cpp
! src/hotspot/cpu/x86/interp_masm_x86.hpp
! src/hotspot/cpu/x86/macroAssembler_x86.cpp
! src/hotspot/cpu/x86/macroAssembler_x86.hpp
! src/hotspot/cpu/x86/sharedRuntime_x86_64.cpp
! src/hotspot/cpu/x86/templateTable_x86.cpp
! src/hotspot/cpu/x86/vm_version_x86.hpp
! src/hotspot/cpu/x86/x86_64.ad
! src/hotspot/share/c1/c1_LIRAssembler.cpp
! src/hotspot/share/c1/c1_LIRAssembler.hpp
! src/hotspot/share/ci/ciMethod.cpp
! src/hotspot/share/ci/ciMethod.hpp
! src/hotspot/share/oops/cpCache.cpp
! src/hotspot/share/oops/method.cpp
! src/hotspot/share/oops/method.hpp
! src/hotspot/share/oops/methodData.hpp
! src/hotspot/share/opto/compile.cpp
! src/hotspot/share/opto/compile.hpp
! src/hotspot/share/opto/parse.hpp
! src/hotspot/share/opto/parse1.cpp
! src/hotspot/share/runtime/deoptimization.cpp
! src/hotspot/share/runtime/deoptimization.hpp
! src/hotspot/share/runtime/sharedRuntime.cpp
! src/hotspot/share/runtime/vmStructs.cpp
! src/hotspot/share/runtime/vm_version.hpp
+ test/hotspot/jtreg/runtime/clinit/ClassInitBarrier.java
+ test/hotspot/jtreg/runtime/clinit/libClassInitBarrier.cpp

Changeset: ebc4e5a625e2
Author:    chegar
Date:      2019-05-30 12:36 +0100
URL:       http://hg.openjdk.java.net/valhalla/valhalla/rev/ebc4e5a625e2

8224730: java.net.ServerSocket::toString not invoking checkConnect
Reviewed-by: alanb

! src/java.base/share/classes/java/net/ServerSocket.java
+ test/jdk/java/net/ServerSocket/TestLocalAddress.java

Changeset: 931a4d5367a6
Author:    sundar
Date:      2019-05-30 17:30 +0530
URL:       http://hg.openjdk.java.net/valhalla/valhalla/rev/931a4d5367a6

8224946: jrtfs URI to Path and Path to URI conversions are wrong
Reviewed-by: alanb

! src/java.base/share/classes/jdk/internal/jrtfs/JrtFileSystemProvider.java
! src/java.base/share/classes/jdk/internal/jrtfs/JrtPath.java
! test/jdk/jdk/internal/jrtfs/Basic.java
! test/jdk/tools/jlink/plugins/ExcludeVMPluginTest.java
! test/jdk/tools/jlink/plugins/SystemModuleDescriptors/ModuleTargetHelper.java
! test/langtools/tools/lib/toolbox/JarTask.java

Changeset: 430da9dcfcb2
Author:    bobv
Date:      2019-05-30 07:07 -0400
URL:       http://hg.openjdk.java.net/valhalla/valhalla/rev/430da9dcfcb2

8222252: Java ergonomics limits heap to 128GB with disabled compressed oops
Reviewed-by: dholmes

! src/hotspot/share/runtime/arguments.cpp

Changeset: 31f43d8e7afb
Author:    mullan
Date:      2019-05-30 09:24 -0400
URL:       http://hg.openjdk.java.net/valhalla/valhalla/rev/31f43d8e7afb

8224767: Add String constants for Canonical XML 1.1 URIs
Reviewed-by: xuelei

! src/java.xml.crypto/share/classes/javax/xml/crypto/dsig/CanonicalizationMethod.java
! src/java.xml.crypto/share/classes/javax/xml/crypto/dsig/TransformService.java

Changeset: 17f85a8780d5
Author:    vlivanov
Date:      2019-05-30 19:12 +0300
URL:       http://hg.openjdk.java.net/valhalla/valhalla/rev/17f85a8780d5

8223216: C2: Unify class initialization checks between new, getstatic, and putstatic
Reviewed-by: kvn, dlong

! src/hotspot/share/opto/bytecodeInfo.cpp
! src/hotspot/share/opto/compile.cpp
! src/hotspot/share/opto/compile.hpp
! src/hotspot/share/opto/graphKit.cpp
! src/hotspot/share/opto/graphKit.hpp
! src/hotspot/share/opto/parse.hpp
! src/hotspot/share/opto/parse1.cpp
! src/hotspot/share/opto/parse3.cpp
! src/hotspot/share/opto/parseHelper.cpp

Changeset: 63fa55abb6d2
Author:    chegar
Date:      2019-05-30 18:10 +0100
URL:       http://hg.openjdk.java.net/valhalla/valhalla/rev/63fa55abb6d2

8225060: java.net.DefaultInterface invokes NetworkInterface::getInetAddresses without doPriv
Reviewed-by: alanb

! src/java.base/macosx/classes/java/net/DefaultInterface.java

Changeset: ad4285992012
Author:    jjg
Date:      2019-05-30 10:37 -0700
URL:       http://hg.openjdk.java.net/valhalla/valhalla/rev/ad4285992012

8224257: fix issues in files generated by pandoc
Reviewed-by: tbell, jjg, erikj
Contributed-by: jonathan.gibbons at oracle.com, erik.joelsson at oracle.com

! make/Docs.gmk
! make/Main.gmk
! make/ToolsJdk.gmk

Changeset: a41029c383bf
Author:    jjg
Date:      2019-05-30 11:00 -0700
URL:       http://hg.openjdk.java.net/valhalla/valhalla/rev/a41029c383bf

8225066: Add missing file
Reviewed-by: mchung

+ make/jdk/src/classes/build/tools/fixuppandoc/Main.java

Changeset: 6515a96809a1
Author:    fyang
Date:      2019-05-30 10:29 +0800
URL:       http://hg.openjdk.java.net/valhalla/valhalla/rev/6515a96809a1

8224828: aarch64: rflags is not correct after safepoint poll
Reviewed-by: aph, adinn
Contributed-by: Xiang Yuan <yuanxiang4 at huawei.com>

! src/hotspot/cpu/aarch64/aarch64.ad
! src/hotspot/cpu/aarch64/sharedRuntime_aarch64.cpp

Changeset: a0d4e61acb6b
Author:    skuksenko
Date:      2019-05-30 12:45 -0700
URL:       http://hg.openjdk.java.net/valhalla/valhalla/rev/a0d4e61acb6b

8223504: Improve performance of forall loops by better inlining of "iterator()" methods
Reviewed-by: vlivanov, shade

! src/hotspot/share/classfile/systemDictionary.hpp
! src/hotspot/share/classfile/vmSymbols.hpp
! src/hotspot/share/opto/bytecodeInfo.cpp

Changeset: 5212c250f9a8
Author:    jjg
Date:      2019-05-30 13:45 -0700
URL:       http://hg.openjdk.java.net/valhalla/valhalla/rev/5212c250f9a8

8225077: fix references to broken link in java.compiler module
Reviewed-by: darcy, lancea

! src/java.compiler/share/classes/javax/annotation/processing/Filer.java

Changeset: b6418e5aad70
Author:    sspitsyn
Date:      2019-05-30 15:55 -0700
URL:       http://hg.openjdk.java.net/valhalla/valhalla/rev/b6418e5aad70

8223718: Checks in check_slot_type_no_lvt() should be always executed
Summary: Call check_slot_type_no_lvt() even if the LVT is present
Reviewed-by: kvn, gadams, amenkov

! src/hotspot/share/prims/jvmtiImpl.cpp
! test/hotspot/jtreg/vmTestbase/nsk/jvmti/unit/GetLocalVariable/getlocal003/getlocal003.cpp

Changeset: 9ea55cb79d77
Author:    darcy
Date:      2019-05-30 16:21 -0700
URL:       http://hg.openjdk.java.net/valhalla/valhalla/rev/9ea55cb79d77

8224687: Add clarifying overrides of Element.asType to more specific subinterfaces
Reviewed-by: jjg

! src/java.compiler/share/classes/javax/lang/model/element/Element.java
! src/java.compiler/share/classes/javax/lang/model/element/ExecutableElement.java
! src/java.compiler/share/classes/javax/lang/model/element/ModuleElement.java
! src/java.compiler/share/classes/javax/lang/model/element/PackageElement.java
! src/java.compiler/share/classes/javax/lang/model/element/TypeElement.java
! src/java.compiler/share/classes/javax/lang/model/element/TypeParameterElement.java
! src/java.compiler/share/classes/javax/lang/model/element/VariableElement.java
+ test/langtools/tools/javac/processing/model/element/TestElementAsType.java

Changeset: 04ff1e00635a
Author:    zgu
Date:      2019-05-29 11:55 -0400
URL:       http://hg.openjdk.java.net/valhalla/valhalla/rev/04ff1e00635a

8224978: Shenandoah: Allows root verifier to verify some roots outside safepoints with proper locks
Reviewed-by: shade

! src/hotspot/share/gc/shenandoah/shenandoahAsserts.cpp
! src/hotspot/share/gc/shenandoah/shenandoahAsserts.hpp
! src/hotspot/share/gc/shenandoah/shenandoahRootProcessor.cpp
! src/hotspot/share/gc/shenandoah/shenandoahRootVerifier.cpp
! src/hotspot/share/gc/shenandoah/shenandoahVerifier.cpp

Changeset: b0513c833960
Author:    jjg
Date:      2019-05-30 17:28 -0700
URL:       http://hg.openjdk.java.net/valhalla/valhalla/rev/b0513c833960

8220251: fix headings in java.management
Reviewed-by: lancea

! src/java.management.rmi/share/classes/javax/management/remote/rmi/package.html
! src/java.management/share/classes/java/lang/management/LockInfo.java
! src/java.management/share/classes/java/lang/management/ManagementFactory.java
! src/java.management/share/classes/java/lang/management/MemoryMXBean.java
! src/java.management/share/classes/java/lang/management/MemoryPoolMXBean.java
! src/java.management/share/classes/java/lang/management/MemoryUsage.java
! src/java.management/share/classes/java/lang/management/MonitorInfo.java
! src/java.management/share/classes/java/lang/management/ThreadInfo.java
! src/java.management/share/classes/java/lang/management/ThreadMXBean.java
! src/java.management/share/classes/java/lang/management/package.html
! src/java.management/share/classes/javax/management/MXBean.java
! src/java.management/share/classes/javax/management/NotificationBroadcaster.java
! src/java.management/share/classes/javax/management/NotificationEmitter.java
! src/java.management/share/classes/javax/management/remote/package.html
! src/jdk.management.jfr/share/classes/jdk/management/jfr/FlightRecorderMXBean.java
! src/jdk.management/share/classes/com/sun/management/GcInfo.java

Changeset: f19a728d576d
Author:    zgu
Date:      2019-05-30 21:12 -0400
URL:       http://hg.openjdk.java.net/valhalla/valhalla/rev/f19a728d576d

8225014: Separate ShenandoahRootScanner method for object_iterate
Reviewed-by: shade

! src/hotspot/share/gc/shenandoah/shenandoahHeap.cpp
! src/hotspot/share/gc/shenandoah/shenandoahRootProcessor.hpp
! src/hotspot/share/gc/shenandoah/shenandoahRootProcessor.inline.hpp
+ test/hotspot/jtreg/gc/shenandoah/TestObjItrWithHeapDump.java

Changeset: d4475420fb9a
Author:    sundar
Date:      2019-05-31 08:27 +0530
URL:       http://hg.openjdk.java.net/valhalla/valhalla/rev/d4475420fb9a

8216535: tools/jimage/JImageExtractTest.java timed out
Reviewed-by: jlaskey

! test/jdk/tools/jimage/JImageExtractTest.java

Changeset: 7b70f269fe0d
Author:    neliasso
Date:      2019-05-31 10:13 +0200
URL:       http://hg.openjdk.java.net/valhalla/valhalla/rev/7b70f269fe0d

8224538: LoadBarrierNode::common_barrier must check address
Reviewed-by: thartmann, kvn

! src/hotspot/share/gc/z/c2/zBarrierSetC2.cpp

Changeset: f91999057a5a
Author:    redestad
Date:      2019-05-31 12:20 +0200
URL:       http://hg.openjdk.java.net/valhalla/valhalla/rev/f91999057a5a

8224986: (str) optimize StringBuilder.append(CharSequence, int, int) for String arguments
Reviewed-by: jlaskey, rriggs

! src/java.base/share/classes/java/lang/AbstractStringBuilder.java
! src/java.base/share/classes/java/lang/String.java
! test/micro/org/openjdk/bench/java/lang/StringBuilders.java

Changeset: 89ac8ad48ac6
Author:    phedlin
Date:      2019-05-16 17:09 +0200
URL:       http://hg.openjdk.java.net/valhalla/valhalla/rev/89ac8ad48ac6

8225110: IGV build definition uses non-secure transport
Reviewed-by: neliasso

! src/utils/IdealGraphVisualizer/nbproject/platform.properties

Changeset: d2bc284803bc
Author:    chegar
Date:      2019-05-31 15:02 +0100
URL:       http://hg.openjdk.java.net/valhalla/valhalla/rev/d2bc284803bc

8224973: URLStreamHandler.openConnection(URL,Proxy) - spec and implementation mismatch
Reviewed-by: alanb, dfuchs

! src/java.base/share/classes/java/net/URLStreamHandler.java
+ test/jdk/java/net/URLStreamHandler/TestDefaultBehavior.java

Changeset: f0ef081cb15d
Author:    azeller
Date:      2019-05-28 20:12 +0200
URL:       http://hg.openjdk.java.net/valhalla/valhalla/rev/f0ef081cb15d

8194231: java/net/DatagramSocket/ReuseAddressTest.java failed with java.net.BindException: Address already in use: Cannot bind
Summary: Changed test to no longer use hardcoded ports.
Reviewed-by: chegar, clanger

! test/jdk/java/net/DatagramSocket/ReuseAddressTest.java

Changeset: 35192d9c2b76
Author:    pchilanomate
Date:      2019-05-31 11:17 -0400
URL:       http://hg.openjdk.java.net/valhalla/valhalla/rev/35192d9c2b76

8225016: Dead code due to VMOperationQueue::add() always returning true
Summary: Removed dead code in vmThread.cpp
Reviewed-by: coleenp, hseigel, dholmes

! src/hotspot/share/runtime/vmThread.cpp
! src/hotspot/share/runtime/vmThread.hpp

Changeset: baad58d0cbfe
Author:    jjg
Date:      2019-05-31 09:26 -0700
URL:       http://hg.openjdk.java.net/valhalla/valhalla/rev/baad58d0cbfe

8225094: Fix minor HTML issues in jdk.zipfs
Reviewed-by: clanger, mchung, lancea

! src/jdk.zipfs/share/classes/module-info.java

Changeset: e6e4de80e058
Author:    hseigel
Date:      2019-05-31 13:09 -0400
URL:       http://hg.openjdk.java.net/valhalla/valhalla/rev/e6e4de80e058

8222936: mlvm/anonloader/stress/randomBytecodes/Test.java fails due to "ERROR: There were 1 hangups during parsing."
Summary: Prevent false failures by blocking the test until either it times out or the loading thread finishes
Reviewed-by: dholmes, coleenp

! test/hotspot/jtreg/vmTestbase/vm/mlvm/anonloader/share/StressClassLoadingTest.java

Changeset: 9889f5e3ba00
Author:    jjg
Date:      2019-05-31 10:59 -0700
URL:       http://hg.openjdk.java.net/valhalla/valhalla/rev/9889f5e3ba00

8225129: Fix minor HTML issues in java.naming
Reviewed-by: mchung, lancea

! src/java.naming/share/classes/javax/naming/directory/package.html
! src/java.naming/share/classes/javax/naming/event/package.html
! src/java.naming/share/classes/javax/naming/ldap/InitialLdapContext.java
! src/java.naming/share/classes/javax/naming/ldap/package.html
! src/java.naming/share/classes/javax/naming/package.html
! src/java.naming/share/classes/javax/naming/spi/package.html

Changeset: 4c1b0b71c629
Author:    bpb
Date:      2019-05-31 11:13 -0700
URL:       http://hg.openjdk.java.net/valhalla/valhalla/rev/4c1b0b71c629

8225117: java/math/BigInteger/SymmetricRangeTests.java fails with ParseException
Reviewed-by: darcy

! test/jdk/java/math/BigInteger/StringConstructorOverflow.java
! test/jdk/java/math/BigInteger/SymmetricRangeTests.java

Changeset: 3f2f89737be5
Author:    kbarrett
Date:      2019-05-31 14:42 -0400
URL:       http://hg.openjdk.java.net/valhalla/valhalla/rev/3f2f89737be5

8219149: ProcessTools.ProcessBuilder should print timing info for subprocesses
Summary: Add some timestamped logging messages to OutputBuffer.
Reviewed-by: rriggs, dcubed, lmesnik, dholmes

! test/lib/jdk/test/lib/process/OutputBuffer.java

Changeset: 72474808e305
Author:    iklam
Date:      2019-05-31 12:51 -0700
URL:       http://hg.openjdk.java.net/valhalla/valhalla/rev/72474808e305

8224692: runtime/appcds tests crash in "HotSpotJVMCI::compute_offset" when running in Graal as JIT mode
Reviewed-by: ccheung

! src/hotspot/share/classfile/symbolTable.cpp
! src/hotspot/share/memory/dynamicArchive.cpp
! test/hotspot/jtreg/runtime/appcds/dynamicArchive/NoClassToArchive.java

Changeset: 8b1f7d88746a
Author:    erikj
Date:      2019-05-31 13:37 -0700
URL:       http://hg.openjdk.java.net/valhalla/valhalla/rev/8b1f7d88746a

8219788: Configure recommends JDK 8
Reviewed-by: tbell

! make/autoconf/help.m4

Changeset: a3596ce8de19
Author:    naoto
Date:      2019-05-31 13:49 -0700
URL:       http://hg.openjdk.java.net/valhalla/valhalla/rev/a3596ce8de19

8223773: DateTimeFormatter Fails to throw an Exception on Invalid CLOCK_HOUR_OF_AMPM and HOUR_OF_AMPM
Reviewed-by: lancea, scolebourne, rriggs

! src/java.base/share/classes/java/time/format/Parsed.java
! test/jdk/java/time/test/java/time/format/TestDateTimeParsing.java

Changeset: c40c3e5d7c7a
Author:    cushon
Date:      2019-05-22 15:30 -0700
URL:       http://hg.openjdk.java.net/valhalla/valhalla/rev/c40c3e5d7c7a

8224629: Unnecessary cast in LambdaToMethod
Reviewed-by: vromero
Contributed-by: Alan Malloy <amalloy at google.com>

! src/jdk.compiler/share/classes/com/sun/tools/javac/comp/LambdaToMethod.java

Changeset: b564f266dda0
Author:    vromero
Date:      2019-05-31 18:35 -0400
URL:       http://hg.openjdk.java.net/valhalla/valhalla/rev/b564f266dda0

8224083: javadoc Reporter generates warning for Kind.NOTE
8224082: NPE in javadoc Reporter
Reviewed-by: jjg

! src/jdk.javadoc/share/classes/jdk/javadoc/internal/tool/Messager.java
+ test/langtools/jdk/javadoc/tool/reporter_generates_warnings/ReporterGeneratesWarningsInsteadOfNotes.java
+ test/langtools/jdk/javadoc/tool/reporter_generates_warnings/pkg/MyDoclet.java

Changeset: 3ea18959a349
Author:    ccheung
Date:      2019-05-31 15:49 -0700
URL:       http://hg.openjdk.java.net/valhalla/valhalla/rev/3ea18959a349

8223336: Assert in VirtualMemoryTracker::remove_released_region when running the SharedArchiveConsistency.java test with -XX:NativeMemoryTracking=detail
Summary: added the missing call MemTracker::record_virtual_memory_reserve_and_commit()
Reviewed-by: jiangli, zgu

! src/hotspot/os/windows/os_windows.cpp
! test/hotspot/jtreg/ProblemList.txt

Changeset: d4890c3721be
Author:    jjg
Date:      2019-05-31 17:27 -0700
URL:       http://hg.openjdk.java.net/valhalla/valhalla/rev/d4890c3721be

8225134: Update man-page files
Reviewed-by: erikj, mchung

! src/java.base/share/man/java.1
! src/java.base/share/man/keytool.1
! src/java.rmi/share/man/rmid.1
! src/java.rmi/share/man/rmiregistry.1
! src/java.scripting/share/man/jrunscript.1
! src/jdk.compiler/share/man/javac.1
! src/jdk.compiler/share/man/serialver.1
+ src/jdk.hotspot.agent/share/man/jhsdb.1
! src/jdk.jartool/share/man/jar.1
! src/jdk.jartool/share/man/jarsigner.1
! src/jdk.javadoc/share/man/javadoc.1
! src/jdk.jcmd/share/man/jcmd.1
! src/jdk.jcmd/share/man/jinfo.1
! src/jdk.jcmd/share/man/jmap.1
! src/jdk.jcmd/share/man/jps.1
! src/jdk.jcmd/share/man/jstack.1
! src/jdk.jcmd/share/man/jstat.1
! src/jdk.jconsole/share/man/jconsole.1
! src/jdk.jdeps/share/man/javap.1
+ src/jdk.jdeps/share/man/jdeprscan.1
! src/jdk.jdeps/share/man/jdeps.1
! src/jdk.jdi/share/man/jdb.1
+ src/jdk.jlink/share/man/jlink.1
+ src/jdk.jlink/share/man/jmod.1
+ src/jdk.jshell/share/man/jshell.1
! src/jdk.jstatd/share/man/jstatd.1
! src/jdk.pack/share/man/pack200.1
! src/jdk.pack/share/man/unpack200.1
! src/jdk.rmic/share/man/rmic.1
! src/jdk.scripting.nashorn.shell/share/man/jjs.1

Changeset: db105c4c5776
Author:    redestad
Date:      2019-06-01 03:18 +0200
URL:       http://hg.openjdk.java.net/valhalla/valhalla/rev/db105c4c5776

8225061: Performance regression in Regex
Reviewed-by: naoto, alanb
Contributed-by: claes.redestad at oracle.com, naoto.sato at oracle.com

! make/jdk/src/classes/build/tools/generateemojidata/GenerateEmojiData.java
! src/java.base/share/classes/java/util/regex/EmojiData.java.template
! src/java.base/share/classes/java/util/regex/Grapheme.java
! src/java.base/share/classes/java/util/regex/Pattern.java
+ test/micro/org/openjdk/bench/java/util/regex/PatternBench.java

Changeset: e2dbcc6ed36d
Author:    rfield
Date:      2019-06-01 13:41 -0700
URL:       http://hg.openjdk.java.net/valhalla/valhalla/rev/e2dbcc6ed36d

8080353: JShell: Better error message on attempting to add default method
Summary: Special handling for errors with "default" modifier
Reviewed-by: jlahoda

! src/jdk.jshell/share/classes/jdk/jshell/Eval.java
! test/langtools/ProblemList.txt
! test/langtools/jdk/jshell/ExceptionsTest.java
! test/langtools/jdk/jshell/MethodsTest.java

Changeset: 905b2a416250
Author:    rfield
Date:      2019-06-01 14:09 -0700
URL:       http://hg.openjdk.java.net/valhalla/valhalla/rev/905b2a416250

8223688: JShell: crash on the instantiation of raw anonymous class
Reviewed-by: jlahoda

! src/jdk.jshell/share/classes/jdk/internal/jshell/tool/JShellTool.java
! test/langtools/jdk/jshell/ToolBasicTest.java

Changeset: 65896ed82849
Author:    shade
Date:      2019-06-02 10:08 +0200
URL:       http://hg.openjdk.java.net/valhalla/valhalla/rev/65896ed82849

8225104: 32-bit build failures after JDK-8222252
Reviewed-by: bobv, rkennke, dholmes

! src/hotspot/share/runtime/arguments.cpp

Changeset: 249b2b4fcb7d
Author:    shade
Date:      2019-06-02 10:08 +0200
URL:       http://hg.openjdk.java.net/valhalla/valhalla/rev/249b2b4fcb7d

8225111: Make Shenandoah tests work with 32-bit VMs
Reviewed-by: rkennke

! test/hotspot/jtreg/gc/TestHumongousReferenceObject.java
! test/hotspot/jtreg/gc/shenandoah/TestHeapUncommit.java
! test/hotspot/jtreg/gc/shenandoah/TestHumongousThreshold.java
! test/hotspot/jtreg/gc/shenandoah/TestLargeObjectAlignment.java
! test/hotspot/jtreg/gc/shenandoah/compiler/TestNullCheck.java
! test/hotspot/jtreg/gc/shenandoah/compiler/TestReferenceCAS.java
! test/hotspot/jtreg/gc/shenandoah/jvmti/TestHeapDump.java
! test/hotspot/jtreg/gc/shenandoah/options/TestObjectAlignment.java

Changeset: aa5eeb1a9871
Author:    shade
Date:      2019-06-02 10:08 +0200
URL:       http://hg.openjdk.java.net/valhalla/valhalla/rev/aa5eeb1a9871

8225048: Shenandoah x86_32 support
Reviewed-by: erikj, rkennke

! make/autoconf/hotspot.m4
! src/hotspot/cpu/x86/gc/shenandoah/c1/shenandoahBarrierSetC1_x86.cpp
! src/hotspot/cpu/x86/gc/shenandoah/shenandoahBarrierSetAssembler_x86.cpp
+ src/hotspot/cpu/x86/gc/shenandoah/shenandoah_x86_32.ad
! src/hotspot/share/gc/shenandoah/c2/shenandoahSupport.cpp
! src/hotspot/share/gc/shenandoah/shenandoahArguments.cpp

Changeset: d22206f24d59
Author:    lancea
Date:      2019-06-02 17:13 -0400
URL:       http://hg.openjdk.java.net/valhalla/valhalla/rev/d22206f24d59

8212807: tools/jar/multiRelease/Basic.java times out
Reviewed-by: bchristi

! test/jdk/tools/jar/multiRelease/Basic.java
! test/jdk/tools/jar/multiRelease/MRTestBase.java
! test/lib/jdk/test/lib/process/OutputAnalyzer.java

Changeset: 0dab93cb3b0c
Author:    tschatzl
Date:      2019-06-03 10:50 +0200
URL:       http://hg.openjdk.java.net/valhalla/valhalla/rev/0dab93cb3b0c

8223162: Improve ergonomics for Sparse PRT entry sizing
Summary: Scale Sparse PRT table sizes exponentially according to region size.
Reviewed-by: kbarrett, sangheki

! src/hotspot/share/gc/g1/heapRegionRemSet.cpp
! src/hotspot/share/gc/g1/heapRegionRemSet.hpp
! src/hotspot/share/gc/g1/sparsePRT.hpp

Changeset: 00f7fce88e25
Author:    tschatzl
Date:      2019-06-03 10:51 +0200
URL:       http://hg.openjdk.java.net/valhalla/valhalla/rev/00f7fce88e25

8223693: Memory wastage in size of per-region type buffers in GC
Reviewed-by: kbarrett, sangheki

! src/hotspot/share/gc/g1/g1HeapRegionAttr.hpp
! src/hotspot/share/gc/g1/g1ParScanThreadState.cpp

Changeset: ba171f871932
Author:    phedlin
Date:      2019-05-28 14:56 +0200
URL:       http://hg.openjdk.java.net/valhalla/valhalla/rev/ba171f871932

8223363: Bad node estimate assertion failure
8223502: Node estimate for loop unswitching is not correct: assert(delta <= 2 * required) failed: Bad node estimate
8224648: assert(!exceeding_node_budget()) failed: Too many NODES required! failure with ctw
Summary: Tighten the node estimates. New est_loop_clone_sz() implementation that will compute a "fan-out" complexity estimate as part of the size estimate (to better estimate complex loop body size after cloning). New est_loop_unroll_sz() function, used to estimate the size of a loop body att full/maximal unrolling. Correction to node budget final tests and asserts.
Reviewed-by: neliasso, kvn

! src/hotspot/share/opto/loopTransform.cpp
! src/hotspot/share/opto/loopUnswitch.cpp
! src/hotspot/share/opto/loopnode.cpp
! src/hotspot/share/opto/loopnode.hpp
! src/hotspot/share/opto/loopopts.cpp
+ test/hotspot/jtreg/compiler/loopopts/LoopUnswitchingBadNodeBudget.java

Changeset: 9691a169f1dd
Author:    roland
Date:      2019-05-21 15:46 +0200
URL:       http://hg.openjdk.java.net/valhalla/valhalla/rev/9691a169f1dd

8173196: [REDO] C2 does not optimize redundant memory operations with G1
Reviewed-by: thartmann, kvn

! src/hotspot/share/gc/g1/c2/g1BarrierSetC2.cpp
! src/hotspot/share/gc/shared/c2/cardTableBarrierSetC2.cpp
! src/hotspot/share/opto/graphKit.cpp
! src/hotspot/share/opto/graphKit.hpp

Changeset: 6c205bbdafd2
Author:    shade
Date:      2019-06-03 14:50 +0200
URL:       http://hg.openjdk.java.net/valhalla/valhalla/rev/6c205bbdafd2

8225046: Shenandoah metrics logs refactoring
Reviewed-by: rkennke

! src/hotspot/share/gc/shenandoah/shenandoahHeap.cpp
! src/hotspot/share/gc/shenandoah/shenandoahMetrics.cpp
! src/hotspot/share/gc/shenandoah/shenandoahMetrics.hpp

Changeset: 47d928ba8733
Author:    eosterlund
Date:      2019-06-03 13:35 +0200
URL:       http://hg.openjdk.java.net/valhalla/valhalla/rev/47d928ba8733

8224814: Remove dead JNIHandleBlock freelist code
Reviewed-by: stefank, tschatzl, kbarrett

! src/hotspot/share/runtime/jniHandles.cpp
! src/hotspot/share/runtime/jniHandles.hpp

Changeset: fdddd05767ce
Author:    eosterlund
Date:      2019-06-03 13:35 +0200
URL:       http://hg.openjdk.java.net/valhalla/valhalla/rev/fdddd05767ce

8224816: Provide os::processor_id() implementation for Mac OS
Reviewed-by: rehn, pliden, kbarrett, gziemski

! src/hotspot/os/bsd/os_bsd.cpp

Changeset: 4ffd6a955e92
Author:    rfield
Date:      2019-06-03 07:46 -0700
URL:       http://hg.openjdk.java.net/valhalla/valhalla/rev/4ffd6a955e92

8225151: JShell API: Fix position of @jls tag
Reviewed-by: jjg

! src/jdk.jshell/share/classes/jdk/jshell/Snippet.java

Changeset: 1c291d1c272c
Author:    rfield
Date:      2019-06-03 08:21 -0700
URL:       http://hg.openjdk.java.net/valhalla/valhalla/rev/1c291d1c272c

8199623: JShell: corralling not restored on drop
Reviewed-by: jlahoda

! src/jdk.jshell/share/classes/jdk/jshell/Eval.java
! test/langtools/jdk/jshell/DropTest.java
! test/langtools/jdk/jshell/ToolSimpleTest.java

Changeset: 1cccaaf46c7b
Author:    erikj
Date:      2019-06-03 10:52 -0700
URL:       http://hg.openjdk.java.net/valhalla/valhalla/rev/1cccaaf46c7b

8225140: Build fails if directory contains 'unix'
Reviewed-by: tbell

! make/common/JdkNativeCompilation.gmk
! make/lib/Awt2dLibraries.gmk

Changeset: d3e404cc3972
Author:    rkennke
Date:      2019-06-03 21:28 +0200
URL:       http://hg.openjdk.java.net/valhalla/valhalla/rev/d3e404cc3972

8225171: Remove leftovers in shenandoahBarrierSetC1.cpp
Reviewed-by: shade

! src/hotspot/share/gc/shenandoah/c1/shenandoahBarrierSetC1.cpp

Changeset: a38132298eda
Author:    iveresov
Date:      2019-06-03 13:21 -0700
URL:       http://hg.openjdk.java.net/valhalla/valhalla/rev/a38132298eda

8223320: [AOT] jck test api/javax_script/ScriptEngine/PutGet.html fails when test classes are AOTed
Summary: Materialization of primitive boxes should use caches
Reviewed-by: kvn, never

! src/hotspot/share/aot/aotLoader.cpp
! src/hotspot/share/aot/aotLoader.hpp
! src/hotspot/share/classfile/javaClasses.cpp
! src/hotspot/share/classfile/javaClasses.hpp
! src/hotspot/share/classfile/vmSymbols.hpp
! src/hotspot/share/code/debugInfo.cpp
! src/hotspot/share/code/debugInfo.hpp
! src/hotspot/share/jvmci/jvmciCodeInstaller.cpp
! src/hotspot/share/jvmci/jvmciCompilerToVM.cpp
! src/hotspot/share/jvmci/jvmciJavaClasses.hpp
! src/hotspot/share/runtime/deoptimization.cpp
! src/hotspot/share/runtime/deoptimization.hpp
! src/hotspot/share/runtime/thread.cpp
! src/jdk.internal.vm.ci/share/classes/jdk.vm.ci.code/src/jdk/vm/ci/code/VirtualObject.java
! src/jdk.internal.vm.ci/share/classes/jdk.vm.ci.hotspot/src/jdk/vm/ci/hotspot/HotSpotJVMCIRuntime.java
! src/jdk.internal.vm.compiler/share/classes/org.graalvm.compiler.core/src/org/graalvm/compiler/core/gen/DebugInfoBuilder.java
+ src/jdk.internal.vm.compiler/share/classes/org.graalvm.compiler.hotspot.test/src/org/graalvm/compiler/hotspot/test/BoxDeoptimizationTest.java
! src/jdk.internal.vm.compiler/share/classes/org.graalvm.compiler.serviceprovider/src/org/graalvm/compiler/serviceprovider/GraalServices.java

Changeset: a8ee59471f55
Author:    iveresov
Date:      2019-06-03 14:15 -0700
URL:       http://hg.openjdk.java.net/valhalla/valhalla/rev/a8ee59471f55

8225202: Add missing include after JDK-8223320
Reviewed-by: kvn

! src/hotspot/share/aot/aotLoader.cpp

Changeset: 1a7f82c98eee
Author:    kkharbas
Date:      2019-06-03 11:04 -0700
URL:       http://hg.openjdk.java.net/valhalla/valhalla/rev/1a7f82c98eee

8224247: AllocateOldGenAt fires assertion failure
Summary: Split the heap_reserved_size_bytes() into two methods - one for use during heap initialization and other for at later stages.
Reviewed-by: sangheki, tschatzl

! src/hotspot/share/gc/g1/g1Arguments.cpp
! src/hotspot/share/gc/g1/g1Arguments.hpp
! src/hotspot/share/gc/g1/heapRegionManager.cpp
! src/hotspot/share/gc/parallel/adjoiningGenerationsForHeteroHeap.cpp
! src/hotspot/share/gc/parallel/parallelArguments.cpp
! src/hotspot/share/gc/parallel/parallelArguments.hpp
! src/hotspot/share/prims/whitebox.cpp

Changeset: 030c32236ba3
Author:    jjg
Date:      2019-06-03 16:16 -0700
URL:       http://hg.openjdk.java.net/valhalla/valhalla/rev/030c32236ba3

8225207: redundant <p> in Instrumentation.java
Reviewed-by: lancea

! src/java.instrument/share/classes/java/lang/instrument/Instrumentation.java

Changeset: a03a2455fe3b
Author:    rfield
Date:      2019-06-03 16:24 -0700
URL:       http://hg.openjdk.java.net/valhalla/valhalla/rev/a03a2455fe3b

8225208: Re-Problem list jdk/jshell/ExceptionsTest.java fails on windows
Reviewed-by: jjg

! test/langtools/ProblemList.txt

Changeset: 06d4100ebd32
Author:    coleenp
Date:      2019-06-03 19:42 -0400
URL:       http://hg.openjdk.java.net/valhalla/valhalla/rev/06d4100ebd32

8225212: ProblemList gc/stress/TestReclaimStringsLeaksMemory.java
Reviewed-by: dholmes

! test/hotspot/jtreg/ProblemList.txt

Changeset: a82a367b2d8c
Author:    epavlova
Date:      2019-06-03 17:14 -0700
URL:       http://hg.openjdk.java.net/valhalla/valhalla/rev/a82a367b2d8c

8225199: [Graal] compiler/jvmci/compilerToVM/IsMatureVsReprofileTest.java fails with -XX:CompileThresholdScaling=0.1
Reviewed-by: kvn

! test/hotspot/jtreg/compiler/jvmci/compilerToVM/IsMatureVsReprofileTest.java

Changeset: 2ae056696b15
Author:    rwestberg
Date:      2019-06-03 10:28 +0200
URL:       http://hg.openjdk.java.net/valhalla/valhalla/rev/2ae056696b15

8223678: Add Visual Studio Code workspace generation support (for native code)
Reviewed-by: erikj

+ doc/ide.html
+ doc/ide.md
! make/Main.gmk
! make/UpdateBuildDocs.gmk
! make/common/MakeBase.gmk
! make/common/Utils.gmk
+ make/vscode/CreateVSCodeProject.gmk
+ make/vscode/indexers/ccls-extensions.txt
+ make/vscode/indexers/ccls-notes.txt
+ make/vscode/indexers/ccls-settings.txt
+ make/vscode/indexers/clangd-extensions.txt
+ make/vscode/indexers/clangd-notes.txt
+ make/vscode/indexers/clangd-settings.txt
+ make/vscode/indexers/cpptools-extensions.txt
+ make/vscode/indexers/cpptools-settings.txt
+ make/vscode/indexers/rtags-extensions.txt
+ make/vscode/indexers/rtags-settings.txt
+ make/vscode/template-launch.jsonc
+ make/vscode/template-tasks.jsonc
+ make/vscode/template-workspace-folder.txt
+ make/vscode/template-workspace.jsonc
! test/make/TestMakeBase.gmk

Changeset: b003077e495c
Author:    stuefe
Date:      2019-06-04 07:49 +0200
URL:       http://hg.openjdk.java.net/valhalla/valhalla/rev/b003077e495c

8225178: [Solaris] os::signal() should call sigaction() with SA_SIGINFO
Reviewed-by: dcubed, dholmes

! src/hotspot/os/solaris/os_solaris.cpp

Changeset: cb2628a4f33f
Author:    psadhukhan
Date:      2019-05-15 15:17 +0530
URL:       http://hg.openjdk.java.net/valhalla/valhalla/rev/cb2628a4f33f

8223937: PIT: java/awt/Window/ShapedAndTranslucentWindows/StaticallyShaped.java listed twice in ProblemList
Reviewed-by: jdv, pbansal

! test/jdk/ProblemList.txt

Changeset: 256a5cbb4439
Author:    prr
Date:      2019-05-17 13:05 -0700
URL:       http://hg.openjdk.java.net/valhalla/valhalla/rev/256a5cbb4439

8223804: [macos] remove obsoleted reference to security framework in launcher code
Reviewed-by: rriggs, erikj

! make/lib/CoreLibraries.gmk
! src/java.base/macosx/native/libjava/java_props_macosx.c

Changeset: d23707ad2b00
Author:    serb
Date:      2019-05-17 22:37 -0700
URL:       http://hg.openjdk.java.net/valhalla/valhalla/rev/d23707ad2b00

8224152: [macOS] ProblemList tests that leave rubbish on the screen
Reviewed-by: prr

! test/jdk/ProblemList.txt

Changeset: 9ee0b8733ee4
Author:    serb
Date:      2019-05-17 22:48 -0700
URL:       http://hg.openjdk.java.net/valhalla/valhalla/rev/9ee0b8733ee4

8223766: Remains of ancient code in AWT initialization
Reviewed-by: jdv

! src/java.desktop/unix/native/libawt_xawt/awt/awt_AWTEvent.c
- src/java.desktop/unix/native/libawt_xawt/awt/awt_AWTEvent.h
! src/java.desktop/unix/native/libawt_xawt/awt/awt_Event.c
- src/java.desktop/unix/native/libawt_xawt/awt/awt_Event.h
! src/java.desktop/unix/native/libawt_xawt/awt/awt_Insets.c
- src/java.desktop/unix/native/libawt_xawt/awt/awt_Insets.h
! src/java.desktop/unix/native/libawt_xawt/xawt/XWindow.c
! src/java.desktop/windows/native/libawt/windows/awt_Color.cpp
- src/java.desktop/windows/native/libawt/windows/awt_Color.h
! src/java.desktop/windows/native/libawt/windows/awt_MenuItem.cpp
! src/java.desktop/windows/native/libawt/windows/awt_MenuItem.h
! src/java.desktop/windows/native/libawt/windows/awt_Rectangle.cpp
- src/java.desktop/windows/native/libawt/windows/awt_Rectangle.h

Changeset: 1a80806e7d15
Author:    serb
Date:      2019-05-18 23:35 -0700
URL:       http://hg.openjdk.java.net/valhalla/valhalla/rev/1a80806e7d15

6933331: (d3d/ogl) java.lang.IllegalStateException: Buffers have not been created
Reviewed-by: prr

! src/java.desktop/share/classes/java/awt/Component.java
+ test/jdk/java/awt/image/BufferStrategy/ExceptionAfterComponentDispose.java

Changeset: f36cee599800
Author:    psadhukhan
Date:      2019-05-20 11:03 +0530
URL:       http://hg.openjdk.java.net/valhalla/valhalla/rev/f36cee599800

8224096: Add relevant bugid to java/awt/Window/ShapedAndTranslucentWindows/StaticallyShaped.java in ProblemList
Reviewed-by: jdv, serb

! test/jdk/ProblemList.txt

Changeset: c53905e7dc57
Author:    dmarkov
Date:      2019-05-20 15:42 +0100
URL:       http://hg.openjdk.java.net/valhalla/valhalla/rev/c53905e7dc57

8214579: JFrame does not paint content in XVFB / X11vnc environment
Reviewed-by: prr

! src/java.desktop/unix/classes/sun/java2d/xr/XRSurfaceData.java

Changeset: e2a90479dfe5
Author:    serb
Date:      2019-05-20 12:17 -0700
URL:       http://hg.openjdk.java.net/valhalla/valhalla/rev/e2a90479dfe5

8213516: jck test api/javax_accessibility/AccessibleState/fields.html fails intermittent
Reviewed-by: prr

! src/java.desktop/share/classes/javax/accessibility/AccessibleBundle.java
- test/jdk/javax/accessibility/8197785/AccessibilityBundleMemoryLeakTest.java
+ test/jdk/javax/accessibility/AccessibleBundle/Basic.java

Changeset: 3e0a90050182
Author:    serb
Date:      2019-04-26 23:32 -0700
URL:       http://hg.openjdk.java.net/valhalla/valhalla/rev/3e0a90050182

8222917: GraphicsEnvironment for Unix still have an unused dependency on Solaris
Reviewed-by: prr

! src/java.desktop/share/classes/sun/java2d/SunGraphicsEnvironment.java

Changeset: eba6a83dc23b
Author:    psadhukhan
Date:      2019-05-21 14:41 +0530
URL:       http://hg.openjdk.java.net/valhalla/valhalla/rev/eba6a83dc23b

8214702: Wrong text position for whitespaced string in printing Swing text
Reviewed-by: prr, serb

! src/java.desktop/share/classes/sun/swing/SwingUtilities2.java
+ test/jdk/javax/swing/SwingUtilities/TestTextPosInPrint.java

Changeset: e448d58051ab
Author:    psadhukhan
Date:      2019-05-23 10:50 +0530
URL:       http://hg.openjdk.java.net/valhalla/valhalla/rev/e448d58051ab

8211703: JInternalFrame : java.lang.AssertionError: cannot find the internal frame
Reviewed-by: prr, serb

! src/java.desktop/share/classes/com/sun/java/swing/plaf/gtk/Metacity.java
! test/jdk/sanity/client/SwingSet/src/InternalFrameDemoTest.java

Changeset: d85b366bd8f4
Author:    prr
Date:      2019-05-23 15:02 -0700
URL:       http://hg.openjdk.java.net/valhalla/valhalla/rev/d85b366bd8f4

8223804: [macos] remove obsoleted reference to security framework in launcher code
Reviewed-by: rriggs, erikj

! test/jdk/java/awt/dnd/RemoveDropTargetCrashTest/RemoveDropTargetCrashTest.java

Changeset: f13dba72a5ea
Author:    prr
Date:      2019-05-24 09:10 -0700
URL:       http://hg.openjdk.java.net/valhalla/valhalla/rev/f13dba72a5ea

8224705: Tests that need to be problem-listed or have printer resources
Reviewed-by: serb, psadhukhan

! test/jdk/ProblemList.txt
! test/jdk/java/awt/PrintJob/PrinterException.java
! test/jdk/java/awt/print/PrinterJob/Margins.java

Changeset: 0b1f4dafd492
Author:    prr
Date:      2019-05-24 13:50 -0700
URL:       http://hg.openjdk.java.net/valhalla/valhalla/rev/0b1f4dafd492

8224771: backout RemoveDropTargetCrashTest.java fix to re-push with correct bugid
Reviewed-by: serb

! test/jdk/java/awt/dnd/RemoveDropTargetCrashTest/RemoveDropTargetCrashTest.java

Changeset: 779a8d44523b
Author:    prr
Date:      2019-05-24 13:52 -0700
URL:       http://hg.openjdk.java.net/valhalla/valhalla/rev/779a8d44523b

8224632: testbug: java/awt/dnd/RemoveDropTargetCrashTest/RemoveDropTargetCrashTest.java fails on MacOS
Reviewed-by: serb, psadhukhan

! test/jdk/java/awt/dnd/RemoveDropTargetCrashTest/RemoveDropTargetCrashTest.java

Changeset: 4929c53ff29d
Author:    prr
Date:      2019-05-27 12:24 -0700
URL:       http://hg.openjdk.java.net/valhalla/valhalla/rev/4929c53ff29d

8224778: test/jdk/demo/jfc/J2Ddemo/J2DdemoTest.java cannot find J2Ddemo.jar
Reviewed-by: erikj, psadhukhan

! make/RunTests.gmk
! test/jdk/demo/jfc/J2Ddemo/J2DdemoTest.java

Changeset: 8cddb14bb234
Author:    psadhukhan
Date:      2019-05-28 16:35 +0530
URL:       http://hg.openjdk.java.net/valhalla/valhalla/rev/8cddb14bb234

8224830: test/jdk/java/awt/Focus/ModalExcludedWindowClickTest/ModalExcludedWindowClickTest.java fails on linux-x64
Reviewed-by: jdv

! test/jdk/java/awt/Focus/ModalExcludedWindowClickTest/ModalExcludedWindowClickTest.java

Changeset: f11d2e10a6e4
Author:    psadhukhan
Date:      2019-05-28 16:38 +0530
URL:       http://hg.openjdk.java.net/valhalla/valhalla/rev/f11d2e10a6e4

8224821: java/awt/Focus/NoAutotransferToDisabledCompTest/NoAutotransferToDisabledCompTest.java fails linux-x64
Reviewed-by: jdv

! test/jdk/java/awt/Focus/NoAutotransferToDisabledCompTest/NoAutotransferToDisabledCompTest.java

Changeset: fb7954fde06e
Author:    psadhukhan
Date:      2019-05-30 10:45 +0530
URL:       http://hg.openjdk.java.net/valhalla/valhalla/rev/fb7954fde06e

8224824: ProblemList java/awt/Color/AlphaColorTest failure in linux_x64
Reviewed-by: serb

! test/jdk/ProblemList.txt

Changeset: 4c730a3b5dd9
Author:    prr
Date:      2019-05-30 09:16 -0700
URL:       http://hg.openjdk.java.net/valhalla/valhalla/rev/4c730a3b5dd9

8225020: Problem list some sanity test failures
Reviewed-by: psadhukhan, akolarkunnu

! test/jdk/ProblemList.txt

Changeset: e29c0c8ebd90
Author:    prr
Date:      2019-05-30 09:23 -0700
URL:       http://hg.openjdk.java.net/valhalla/valhalla/rev/e29c0c8ebd90

8225007: java/awt/print/PrinterJob/LandscapeStackOverflow.java may hang
Reviewed-by: serb, jdv

! test/jdk/java/awt/print/PrinterJob/LandscapeStackOverflow.java
! test/jdk/java/awt/print/PrinterJob/PrintToDir.java

Changeset: fdaf7287ea3a
Author:    prr
Date:      2019-05-30 11:52 -0700
URL:       http://hg.openjdk.java.net/valhalla/valhalla/rev/fdaf7287ea3a

8223271: SplashScreen is still shown if defaulting to headless on MacOS
Reviewed-by: bpb, serb, kcr

! make/lib/Awt2dLibraries.gmk
! src/java.base/share/native/libjli/java.c
! src/java.base/share/native/libjli/splashscreen.h
! src/java.base/share/native/libjli/splashscreen_stubs.c
! src/java.desktop/macosx/native/libsplashscreen/splashscreen_sys.m
! src/java.desktop/share/native/libsplashscreen/splashscreen_impl.c
! src/java.desktop/share/native/libsplashscreen/splashscreen_impl.h
! src/java.desktop/unix/native/libsplashscreen/splashscreen_sys.c
! src/java.desktop/windows/native/libsplashscreen/splashscreen_sys.c

Changeset: 55dc1385d1b7
Author:    serb
Date:      2019-05-30 17:14 -0700
URL:       http://hg.openjdk.java.net/valhalla/valhalla/rev/55dc1385d1b7

8225032: Fix some C++ conformance issues in AWT Windows code
Reviewed-by: prr, serb
Contributed-by: andrewluotechnologies at outlook.com

! src/java.desktop/windows/native/libawt/windows/awt.h
! src/java.desktop/windows/native/libawt/windows/awt_Component.h
! src/java.desktop/windows/native/libawt/windows/awt_PrintControl.cpp

Changeset: feb860d41612
Author:    prr
Date:      2019-06-02 12:38 -0700
URL:       http://hg.openjdk.java.net/valhalla/valhalla/rev/feb860d41612

8224056: Fix some assignments of string literals to LPSTR (instead of LPCSTR)
Reviewed-by: prr
Contributed-by: andrewluotechnologies at outlook.com

! src/java.desktop/windows/native/libjsound/PLATFORM_API_WinOS_DirectSound.cpp

Changeset: 26dd6fdc4165
Author:    tnakamura
Date:      2019-06-02 16:59 -0700
URL:       http://hg.openjdk.java.net/valhalla/valhalla/rev/26dd6fdc4165

8219901: Noto fonts for East Asian countries cannot belong to CompositeFont
Reviewed-by: prr, jdv

! src/java.desktop/unix/classes/sun/awt/FcFontManager.java
! src/java.desktop/unix/classes/sun/font/FcFontConfiguration.java
+ test/jdk/java/awt/font/FontNames/FCCompositeTest.java

Changeset: 5f9ef936707c
Author:    psadhukhan
Date:      2019-06-03 11:06 +0530
URL:       http://hg.openjdk.java.net/valhalla/valhalla/rev/5f9ef936707c

Merge

! make/RunTests.gmk
! make/lib/Awt2dLibraries.gmk
- src/hotspot/share/Xusage.txt
- src/hotspot/share/c1/c1_globals.cpp
- src/hotspot/share/gc/shenandoah/shenandoahHeapLock.hpp
- src/hotspot/share/opto/c2_globals.cpp
- src/java.base/share/classes/sun/text/resources/nfc.icu
- src/java.base/share/classes/sun/text/resources/nfkc.icu
- src/java.base/share/classes/sun/text/resources/nfkc_cf.icu
! src/java.base/share/native/libjli/java.c
- src/jdk.javadoc/share/classes/jdk/javadoc/internal/doclets/formats/html/resources/script-dir/jquery-3.3.1.js
- src/jdk.javadoc/share/classes/jdk/javadoc/internal/doclets/formats/html/resources/script-dir/jquery-migrate-3.0.1.js
- src/jdk.javadoc/share/legal/jquery-migrate.md
- test/fmw/gtest/CHANGES
- test/fmw/gtest/LICENSE
- test/fmw/gtest/README
- test/fmw/gtest/include/gtest/gtest-death-test.h
- test/fmw/gtest/include/gtest/gtest-message.h
- test/fmw/gtest/include/gtest/gtest-param-test.h
- test/fmw/gtest/include/gtest/gtest-param-test.h.pump
- test/fmw/gtest/include/gtest/gtest-printers.h
- test/fmw/gtest/include/gtest/gtest-spi.h
- test/fmw/gtest/include/gtest/gtest-test-part.h
- test/fmw/gtest/include/gtest/gtest-typed-test.h
- test/fmw/gtest/include/gtest/gtest.h
- test/fmw/gtest/include/gtest/gtest_pred_impl.h
- test/fmw/gtest/include/gtest/gtest_prod.h
- test/fmw/gtest/include/gtest/internal/gtest-death-test-internal.h
- test/fmw/gtest/include/gtest/internal/gtest-filepath.h
- test/fmw/gtest/include/gtest/internal/gtest-internal.h
- test/fmw/gtest/include/gtest/internal/gtest-linked_ptr.h
- test/fmw/gtest/include/gtest/internal/gtest-param-util-generated.h
- test/fmw/gtest/include/gtest/internal/gtest-param-util-generated.h.pump
- test/fmw/gtest/include/gtest/internal/gtest-param-util.h
- test/fmw/gtest/include/gtest/internal/gtest-port.h
- test/fmw/gtest/include/gtest/internal/gtest-string.h
- test/fmw/gtest/include/gtest/internal/gtest-tuple.h
- test/fmw/gtest/include/gtest/internal/gtest-tuple.h.pump
- test/fmw/gtest/include/gtest/internal/gtest-type-util.h
- test/fmw/gtest/include/gtest/internal/gtest-type-util.h.pump
- test/fmw/gtest/src/gtest-all.cc
- test/fmw/gtest/src/gtest-death-test.cc
- test/fmw/gtest/src/gtest-filepath.cc
- test/fmw/gtest/src/gtest-internal-inl.h
- test/fmw/gtest/src/gtest-port.cc
- test/fmw/gtest/src/gtest-printers.cc
- test/fmw/gtest/src/gtest-test-part.cc
- test/fmw/gtest/src/gtest-typed-test.cc
- test/fmw/gtest/src/gtest.cc
- test/fmw/gtest/src/gtest_main.cc
! test/jdk/ProblemList.txt
- test/jdk/com/sun/jdi/BasicJDWPConnectionTest.java
- test/jdk/java/lang/Character/PropList.txt
- test/jdk/java/lang/Character/PropertyValueAliases.txt
- test/jdk/java/lang/Character/Scripts.txt
- test/jdk/java/lang/Character/SpecialCasing.txt
- test/jdk/java/lang/Character/UnicodeBlock/Blocks.txt
- test/jdk/java/lang/Character/UnicodeData.txt
- test/jdk/java/lang/Character/charprop00.bin
- test/jdk/java/lang/Character/charprop01.bin
- test/jdk/java/lang/Character/charprop02.bin
- test/jdk/java/lang/Character/charprop03.bin
- test/jdk/java/lang/Character/charprop0E.bin
- test/jdk/java/lang/Character/charprop0F.bin
- test/jdk/java/lang/Character/charprop10.bin
- test/jdk/java/util/regex/GraphemeBreakProperty.txt
- test/jdk/java/util/regex/GraphemeBreakTest.txt
- test/jdk/sun/management/windows/revokeall.c
- test/jdk/sun/management/windows/revokeall.exe

Changeset: 4cfbcfac47aa
Author:    jdv
Date:      2019-06-03 11:56 +0530
URL:       http://hg.openjdk.java.net/valhalla/valhalla/rev/4cfbcfac47aa

8225105: java/awt/Focus/ShowFrameCheckForegroundTest/ShowFrameCheckForegroundTest.java fails in Windows 10
Reviewed-by: prr, serb

! test/jdk/java/awt/Focus/ShowFrameCheckForegroundTest/ShowFrameCheckForegroundTest.java

Changeset: 8b8d83cf9097
Author:    psadhukhan
Date:      2019-06-04 13:34 +0530
URL:       http://hg.openjdk.java.net/valhalla/valhalla/rev/8b8d83cf9097

Merge

! make/lib/Awt2dLibraries.gmk



More information about the valhalla-dev mailing list